Peptide,PTM,ModifiedAA,ModifiedPosition,PeptideUniqueToGene,ExperimentDesc,ExpID,PubmedID,ScoreType,IdentScore,LocProb,Log2FChange,PQ-val,QuantSig,PEP,MassErrorPPM
AQNDTVKLIGSWSSPYSLR,nt,A,2,true,"N-terminal ChaFRADIC",92,26010716,"MASCOT Score",71.8300000,,,,,2.7730000510928E-5,
AQNDTVKLIGSWSSPYSLR,nt,A,2,true,"Stromal N-terminome",96,26371235,"MASCOT Score",41.8600000,,,,,,
AQNDTVKLIGSW,nt,A,2,true,"Arg/N-end rule seed, prt6 vs. Wt",99,29168982,"MASCOT Score",44.1300000,,,,,0.014700000174344,-0.8403628
AQNDTVKL,nt,A,2,false,"Arg/N-end rule seed, prt6 vs. Wt",99,29168982,"MASCOT Score",39.6200000,,,,,0.11330000311136,0.4977261
AQNDTVKLIGSWSSPYSLR,nta,A,2,true,"N-terminal ChaFRADIC",92,26010716,"MASCOT Score",71.8300000,,,,,2.7730000510928E-5,
AQNDTVKLIGSWSSPYSLR,nta,A,2,true,"Stromal N-terminome",96,26371235,"MASCOT Score",41.8600000,,,,,,
AQNDTVKLIGSWSSPYSLR,nta,A,2,true,"HUNTER N-terminome: legumain, GluC and trypsin",119,31951383,"MaxQuant score",104.8900000,,,,,,
AQNDTVKLIGSWSSPY,nta,A,2,true,"Arg/N-end rule pathway Roots",80,25728785,"MASCOT Score",26.0500000,,,,,0.00035690001095645,
AQNDTVKLIGSW,nta,A,2,true,"Arg/N-end rule seed, prt6 vs. Wt",99,29168982,"MASCOT Score",44.1300000,,0.3474671,0.7194542,NO,0.014700000174344,-0.8403628
AQNDTVKL,nta,A,2,false,"Arg/N-end rule seed, prt6 vs. Wt",99,29168982,"MASCOT Score",39.6200000,,-0.5702714,0.1276136,NO,0.11330000311136,0.4977261
LIGSWSSPYSLR,ph,S,12,true,"TOR Kinase and ABA Receptor",100,29290610,XCorr,3.0869858,0.8029000,,,,0.00026000000070781,
LIGSWSSPYSLR,ph,S,12,true,"Tissue atlas Arabidopsis - ProteomicsDB",114,32188942,"MaxQuant score",136.9900000,0.9999120,,,,1.8643200746737E-5,
LIGSWSSPYSLR,ph,S,14,true,"Tissue atlas Arabidopsis - ProteomicsDB",114,32188942,"MaxQuant score",193.8100000,0.9478380,,,,2.1859300184934E-24,
LIGSWSSPYSLR,ph,S,15,true,"Lateral root-induction - NAA vs control",106,23328941,"MASCOT Score",24.0000000,,,,,,
LIGSWSSPYSLR,ph,S,15,true,"Tissue atlas Arabidopsis - ProteomicsDB",114,32188942,"MaxQuant score",211.2200000,0.9707610,,,,2.1214999958189E-31,
SVKYEYLDEPDVLK,ph,S,29,true,"Tissue atlas Arabidopsis - ProteomicsDB",114,32188942,"MaxQuant score",180.8800000,1.0000000,,,,2.1640698781716E-22,
SNPIHKK,ac,K,56,false,"Quantitative Acetylproteomics",101,29440448,,,,,,,,
QETTPGLIKWAER,nt,Q,187,true,"HUNTER N-terminome: legumain, GluC and trypsin",119,31951383,"MaxQuant score",72.6520000,,,,,,
