Peptide,PTM,ModifiedAA,ModifiedPosition,PeptideUniqueToGene,ExperimentDesc,ExpID,PubmedID,ScoreType,IdentScore,LocProb,Log2FChange,PQ-val,QuantSig,PEP,MassErrorPPM
ALKSSSADGKTR,nt,A,2,true,"Arabidopsis translation initiation landscape - NT",167b,35069635,,,,,,,,
ALKSSSADGK,nt,A,2,true,"N-term acetylation drought responses",5,26184543,,,,,,,,
SSLVGASE,nt,S,72,true,"N-terminal ChaFRADIC",92,26010716,"MASCOT Score",40.1800000,,,,,0.065109997987747,
AFEPCDGR,ox,C,89,true,"OxiTRAQ Arabidopsis - 5 mM H2O2 versus control",47,24376095,,,,-0.1725409,0.1052249,NO,,
AFEPCDGR,sno,C,89,true,"hot5-4 / wildtype, FAT-switch S-nitrosoproteome",169,37277371,,,,0.6294031,0.0048443,YES,,
YTDYTPCQDQR,ox,C,99,true,"OxiTRAQ Arabidopsis - 5 mM H2O2 versus control",47,24376095,,,,-0.2639094,0.0914217,NO,,
YTDYTPCQDQR,sno,C,99,true,"hot5-4 / wildtype, FAT-switch S-nitrosoproteome",169,37277371,,,,0.3366609,0.0071515,NO,,
DSMIYR,ph,S,112,true,"Phosphoproteome ethylene-regulated time response",46,24043427,"MASCOT Score",22.1400000,,,,,,-36.1040000
HCAPENEK,sno,C,120,true,"hot5-4 / wildtype, FAT-switch S-nitrosoproteome",169,37277371,,,,0.3606300,0.0964367,NO,,
LHCLIPAPK,sno,C,129,true,"hot5-4 / wildtype, FAT-switch S-nitrosoproteome",169,37277371,,,,,,,,
YIDQLASVIPMENGTVR,ng,N,205,true,"Conserved N-glycosylation",74,22633491,"MaxQuant Score",115.5600000,1.0000000,,,,1.593999932048E-11,0.3840000
YIDQLASVIPMENGTVR,ng,N,205,true,"N-linked Glycan Micro-heterogeneity Arabidopsis",134,29237727,,,,,,,,
YIDQLASVIPMENGTVR,ng,N,205,true,"UDP-GlcNAc transporter glycopeptide analysis",135,30224661,,,,,,,6.7664387870536E-7,-0.3000000
AFDMAHCSR,ox,C,277,false,"OxiTRAQ Arabidopsis - 5 mM H2O2 versus control",47,24376095,,,,-0.1137597,0.2835976,NO,,
AFDMAHCSR,sno,C,277,false,"hot5-4 / wildtype, FAT-switch S-nitrosoproteome",169,37277371,,,,,,,,
CLIPWGANDGMYLMEVDR,sno,C,280,true,"S-Nitroso-Proteome guard cells - 30 min flg22",116b,32121556,,,,-0.6438562,0.0350000,YES,,
LLCWEK,ox,C,343,true,"OxiTRAQ Arabidopsis - 5 mM H2O2 versus control",47,24376095,,,,-0.1427517,0.2442052,NO,,
INSLLDTGR,ph,S,457,true,"atm and atr DNA damage response",88,25561503,"MASCOT Score",41.0000000,1.0000000,,,,,0.1200000
CNADDILLEMDR,ox,C,543,true,"OxiTRAQ Arabidopsis - 5 mM H2O2 versus control",47,24376095,,,,-0.1265459,0.3262732,NO,,
QYWVTNSTSTH,ng,N,611,true,"Conserved N-glycosylation",74,22633491,"MaxQuant Score",106.0300000,1.0000000,,,,3.9660000766162E-5,-0.2860000
QYWVTNSTSTH,ng,N,611,true,"N-Glycopeptide Profiling in Arabidopsis Infloresce",132,27067053,"MOWSE score",21.7000000,,,,,0.010999999940395,
QYWVTNSTSTH,ng,N,611,true,"N-linked Glycan Micro-heterogeneity Arabidopsis",134,29237727,,,,,,,,
QYWVTNSTSTH,ng,N,611,true,"UDP-GlcNAc transporter glycopeptide analysis",135,30224661,,,,,,,1.4348277943554E-7,0.4000000
