Peptide,PTM,ModifiedAA,ModifiedPosition,PeptideUniqueToGene,ExperimentDesc,ExpID,PubmedID,ScoreType,IdentScore,LocProb,Log2FChange,PQ-val,QuantSig,PEP,MassErrorPPM
SDDEHHFEASESGASKTYPQSAGNIR,nt,S,2,true,"Arg/N-end rule pathway Roots",80,25728785,"MASCOT Score",44.2900000,,,,,4.507000085141E-6,
SDDEHHFEASESGASKTYPQSAGNIR,nt,S,2,true,"N-terminal ChaFRADIC",92,26010716,"MASCOT Score",29.0500000,,,,,2.3609999288965E-8,
SDDEHHFEASESGASKTYPQSAGNIR,nt,S,2,true,"Stromal N-terminome",96,26371235,"MASCOT Score",45.8100000,,,,,,
SDDEHHFEASESGASKTYPQSAGNIR,nt,S,2,true,"Arg/N-end rule seed, prt6 vs. Wt",99,29168982,"MASCOT Score",57.8700000,,,,,7.7240002838153E-7,-1.3685002
SDDEHHFEASESGASKTYPQSAGNIR,nt,S,2,true,"HUNTER N-terminome: legumain, GluC and trypsin",119,31951383,"MaxQuant score",62.1930000,,,,,,
SDDEHHFEASESGASKTYPQSAGN,nt,S,2,true,"Arg/N-end rule seed, prt6 vs. Wt",99,29168982,"MASCOT Score",51.0600000,,1.3042465,0.1973821,NO,0.0041040000505745,-1.2794542
SDDEHHFEASESGASKTYPQSAGN,nt,S,2,true,"HUNTER N-terminome: legumain, GluC and trypsin",119,31951383,"MaxQuant score",62.0990000,,,,,,
SDDEHHFEASESGASKTYPQSA,nt,S,2,true,"Arg/N-end rule seed, prt6 vs. Wt",99,29168982,"MASCOT Score",30.6700000,,,,,0.02314000017941,-4.4849611
SDDEHHFEASESGASKTYPQ,nt,S,2,true,"Arg/N-end rule seed, prt6 vs. Wt",99,29168982,"MASCOT Score",87.5200000,,,,,3.5650000427268E-6,-1.8816055
SDDEHHFEASESGASKTY,nt,S,2,true,"Arg/N-end rule seed, prt6 vs. Wt",99,29168982,"MASCOT Score",37.5400000,,,,,0.006632000207901,-2.5431318
SDDEHHFEASESGASKT,nt,S,2,true,"Arg/N-end rule seed, prt6 vs. Wt",99,29168982,"MASCOT Score",26.7600000,,,,,0.15790000557899,-0.1532382
SDDEHHFEASESGASK,nt,S,2,true,"Arg/N-end rule seed, prt6 vs. Wt",99,29168982,"MASCOT Score",42.3800000,,,,,0.00037729999166913,-1.1231687
SDDEHHFEASESGA,nt,S,2,true,"Arg/N-end rule seed, prt6 vs. Wt",99,29168982,"MASCOT Score",30.4700000,,,,,0.14869999885559,3.1539489
SDDEHHFEAS,nt,S,2,true,"N-term acetylation drought responses",5,26184543,,,,,,,,
SDDEHHFEAS,nt,S,2,true,"Arg/N-end rule seed, prt6 vs. Wt",99,29168982,"MASCOT Score",25.2700000,,,,,0.2073999941349,-1.1415412
SDDEHHFEASESGASKTYPQSAGNIR,nta,S,2,true,"Arg/N-end rule pathway Roots",80,25728785,"MASCOT Score",80.7800000,,,,,1.904999976432E-6,
SDDEHHFEASESGASKTYPQSAGNIR,nta,S,2,true,"N-terminal ChaFRADIC",92,26010716,"MASCOT Score",29.0500000,,,,,2.3609999288965E-8,
SDDEHHFEASESGASKTYPQSAGNIR,nta,S,2,true,"Stromal N-terminome",96,26371235,"MASCOT Score",45.8100000,,,,,,
SDDEHHFEASESGASKTYPQSAGNIR,nta,S,2,true,"Arg/N-end rule seed, prt6 vs. Wt",99,29168982,"MASCOT Score",57.8700000,,0.3815053,0.1753910,NO,7.7240002838153E-7,-1.3685002
SDDEHHFEASESGASKTYPQSAGNIR,nta,S,2,true,"FtsH12 N-terminome: WT / FtsH12 knockdown miRNA",118,33216923,"MaxQuant score",318.9100000,,,,,0,
SDDEHHFEASESGASKTYPQSAGNIR,nta,S,2,true,"HUNTER N-terminome: legumain, GluC and trypsin",119,31951383,"MaxQuant score",134.7600000,,,,,,
SDDEHHFEASESGASKTYPQSAGNIR,nta,S,2,true,"Arabidopsis translation initiation landscape - NTA",167a,35069635,,,,,,,,
SDDEHHFEASESGASKTYPQSAGN,nta,S,2,true,"Arg/N-end rule seed, prt6 vs. Wt",99,29168982,"MASCOT Score",51.0600000,,0.2634524,0.3564879,NO,0.0041040000505745,-1.2794542
SDDEHHFEASESGASKTYPQSAGN,nta,S,2,true,"HUNTER N-terminome: legumain, GluC and trypsin",119,31951383,"MaxQuant score",48.2240000,,,,,,
SDDEHHFEASESGASKTYPQSA,nta,S,2,true,"Arg/N-end rule seed, prt6 vs. Wt",99,29168982,"MASCOT Score",30.6700000,,0.4306860,0.2242240,NO,0.02314000017941,-4.4849611
SDDEHHFEASESGASKTYPQ,nta,S,2,true,"Arg/N-end rule seed, prt6 vs. Wt",99,29168982,"MASCOT Score",87.5200000,,0.0296143,0.7947381,NO,3.5650000427268E-6,-1.8816055
SDDEHHFEASESGASKTY,nta,S,2,true,"Arg/N-end rule seed, prt6 vs. Wt",99,29168982,"MASCOT Score",37.5400000,,0.0382516,0.8626447,NO,0.006632000207901,-2.5431318
SDDEHHFEASESGASKT,nta,S,2,true,"Arg/N-end rule seed, prt6 vs. Wt",99,29168982,"MASCOT Score",26.7600000,,-0.0942047,0.5824582,NO,0.15790000557899,-0.1532382
SDDEHHFEASESGASK,nta,S,2,true,"Arg/N-end rule pathway Roots",80,25728785,"MASCOT Score",83.0800000,,,,,3.7290000420853E-8,
SDDEHHFEASESGASK,nta,S,2,true,"Arg/N-end rule seed, prt6 vs. Wt",99,29168982,"MASCOT Score",42.3800000,,0.6681141,0.6144803,NO,0.00037729999166913,-1.1231687
SDDEHHFEASESGA,nta,S,2,true,"Arg/N-end rule seed, prt6 vs. Wt",99,29168982,"MASCOT Score",30.4700000,,,,,0.14869999885559,3.1539489
SDDEHHFEAS,nta,S,2,true,"N-term acetylation drought responses",5,26184543,,,,,,,,
SDDEHHFEAS,nta,S,2,true,"Arg/N-end rule seed, prt6 vs. Wt",99,29168982,"MASCOT Score",25.2700000,,,,,0.2073999941349,-1.1415412
SDDEHHFEASESGASKTYPQSAGNIR,ph,S,2,true,"Nitrogen deprivation Ph response",39,22329444,,,,,,,,
SDDEHHFEASESGASKTYPQSAGNIR,ph,S,2,true,"MAPK Arabidopsis substrates",45,23172892,"MaxQuant Score",98.7000000,,,,,,
MSDDEHHFEASESGASK,ph,S,2,true,"atm and atr DNA damage response",88,25561503,"MASCOT Score",74.0000000,1.0000000,,,,,-0.0400000
MSDDEHHFEASESGASK,ph,S,2,true,"TOR Kinase and ABA Receptor",100,29290610,XCorr,3.7693243,1.0000000,,,,0.0033899999689311,
MSDDEHHFEASESGASK,ph,S,2,true,"Lateral root-induction - NAA vs control",106,23328941,"MASCOT Score",48.0000000,,,,,,
SDDEHHFEASESGASK,ph,S,2,true,"Arabidopsis root NAA phosphoproteome",18a,27643528,"MaxQuant Score",172.6600000,1.0000000,,,,2.5720000443442E-23,0.1710000
SDDEHHFEASESGASK,ph,S,2,true,"STN8 phosphoproteome",38,21768351,"MASCOT Score",47.5700000,,,,,,-0.4270240
SDDEHHFEASESGASK,ph,S,2,true,"Phosphoproteome iron-deficient Arabidopsis roots",41,22438062,"MASCOT Score",53.8200000,,,,,,
SDDEHHFEASESGASK,ph,S,2,true,"Phosphoproteome ethylene-regulated time response",46,24043427,"MASCOT Score",67.5600000,,,,,,-3.1086000
SDDEHHFEASESGASK,ph,S,2,true,"Chloroplast kinase substrates",60,19376835,"MASCOT Score",46.2000000,,,,,,-0.2617060
SDDEHHFEASESGASK,ph,S,2,true,"BSK8 and BSL2 regulating sucrose-ph synthase",66,24924143,"MaxQuant Score",184.2200000,,,,,,-0.0883040
SDDEHHFEASESGASK,ph,S,2,true,"srk2dei ABA signaling phopshoproteomics",83,23572148,"MASCOT Score",44.0000000,,,,,,-0.0006000
SDDEHHFEASESGASK,ph,S,2,true,"atm and atr DNA damage response",88,25561503,"MASCOT Score",82.0000000,1.0000000,,,,,-0.5100000
SDDEHHFEASESGASK,ph,S,2,true,"Protein sumoylation and phosphorylation cross-talk",97,28419593,,,,,,,,
SDDEHHFEASESGASK,ph,S,2,true,"Lateral root-induction - NAA vs control",106,23328941,"MASCOT Score",33.0000000,,,,,,
SDDEHHFEASESGASK,ph,S,2,true,"Phospho cell culture sucrose/TOR",109,30833711,,,1.0000000,,,,,
SDDEHHFEASESGASK,ph,S,2,true,"Col-0 callus - FC Col-0 vs. Col-0 Xray",111a,31410901,,67.3400000,,-2.6902934,0.0000000,NO,,0.7215861
SDDEHHFEASESGASK,ph,S,2,true,"Col-0 X-ray callus - FC Col-0 vs. Col-0 Xray",111b,31410901,,67.3400000,,-2.6902934,0.0000000,NO,,0.7215861
SDDEHHFEASESGASK,ph,S,2,true,"atm callus - FC atm vs. atm Xray",111c,31410901,,67.3400000,,2.7152529,0.0000000,NO,,0.7215861
SDDEHHFEASESGASK,ph,S,2,true,"atm-3 X-ray callus - FC atm vs. atm Xray",111d,31410901,,67.3400000,,2.7152529,0.0000000,NO,,0.7215861
SDDEHHFEASESGASK,ph,S,2,true,"Tissue atlas Arabidopsis - ProteomicsDB",114,32188942,"MaxQuant score",341.2700000,1.0000000,,,,0,
ASESGASKTYPQSAGNIR,nt,A,10,true,"Arg/N-end rule pathway Roots",80,25728785,"MASCOT Score",48.1600000,,,,,9.6170003871521E-7,
ASESGASKTYPQSAGNIR,nt,A,10,true,"Arabidopsis translation initiation landscape - NT",167b,35069635,,,,,,,,
SESGASKTYPQSAGNIR,nt,S,11,true,"Arg/N-end rule pathway Roots",80,25728785,"MASCOT Score",30.6600000,,,,,0.0011210000375286,
SESGASKTYPQSAGNIR,nt,S,11,true,"FtsH12 N-terminome: WT / FtsH12 knockdown miRNA",118,33216923,"MaxQuant score",70.9940000,,,,,6.1499999537418E-10,
SESGASKTYPQSAGNIR,nt,S,11,true,"Arabidopsis translation initiation landscape - NT",167b,35069635,,,,,,,,
SDDEHHFEASESGASK,ph,S,11,true,"atm and atr DNA damage response",88,25561503,"MASCOT Score",56.0000000,1.0000000,,,,,-0.6300000
SDDEHHFEASESGASK,ph,S,11,true,"Phospho cell culture sucrose/TOR",109,30833711,,,0.9993160,,,,,
SDDEHHFEASESGASK,ph,S,11,true,"Tissue atlas Arabidopsis - ProteomicsDB",114,32188942,"MaxQuant score",307.9200000,0.9999720,,,,0,
SDDEHHFEASESGASK,ph,S,13,true,"Tissue atlas Arabidopsis - ProteomicsDB",114,32188942,"MaxQuant score",252.0500000,0.9999020,,,,0,
SDDEHHFEASESGASKTYPQSAGNIR,ub,K,17,true,"Arabidopsis ubiquitination COFRADIC",40,26744219,"MaxQuant Score",223.9700000,1.0000000,,,,0,-0.4510000
SDDEHHFEASESGASKTYPQSAGNIR,ub,K,17,true,"upl3 mutant / wildtype",168,35926874,"MaxQuant score",172.4200000,1.0000000,-1.1360615,0.4009000,NO,2.5920600179679E-37,-0.2276200
TYPQSAGNIR,nt,T,18,true,"Metacaspase9 substrates - in vitro rMC9",51c,23964026,"MASCOT Score",63.0000000,,,,,,0.1701269
VVEVSTSKTGK,ac,K,48,false,"Quantitative Acetylproteomics",101,29440448,,,,,,,,
CHFVAIDIFTAK,sno,C,57,true,"Site-specific nitrosomeproteomic id - gsnor1-3",90a,25699590,XCorr,2.8100000,,,,,0.067029997706413,-4.6000000
CHFVAIDIFTAK,sno,C,57,true,"Site-specific nitrosomeproteomic id - gsnor1-3",90b,25699590,XCorr,3.1500000,,,,,0.00066860002698377,-6.6900000
CHFVAIDIFTAK,so,C,57,true,"S-sulfenylation site detection using YAP1C",110,32714340,,,,,,,,
CHFVAIDIFTAKK,ub,K,68,true,"upl3 mutant / wildtype",168,35926874,"MaxQuant score",49.4480000,1.0000000,,,,0.0034718099050224,-0.5868800
KLEDIVPSSHNCDVPHVNR,ub,K,69,false,"upl3 mutant / wildtype",168,35926874,"MaxQuant score",102.8400000,1.0000000,0.3138263,0.2853400,NO,1.7637899474288E-10,-2.3201000
KLEDIVPSSHNCDVPHVNR,ph,S,76,false,"Tissue atlas Arabidopsis - ProteomicsDB",114,32188942,"MaxQuant score",51.2640000,0.7850120,,,,0.00088311301078647,
SHNCDVPHVNRVDY,nt,S,77,false,"Arabidopsis translation initiation landscape - NT",167b,35069635,,,,,,,,
KLEDIVPSSHNCDVPHVNR,ph,S,77,false,"Tissue atlas Arabidopsis - ProteomicsDB",114,32188942,"MaxQuant score",80.8350000,0.9454640,,,,2.7037900508731E-5,
KLEDIVPSSHNCDVPHVNR,ox,C,80,false,"SPEAR - 10 mM H2O2 / mock",138a,34619326,,,,1.2055819,0.0417749,YES,,
KLEDIVPSSHNCDVPHVNR,ox,C,80,false,"SPEAR - 50 mM H2O2 / mock",138b,34619326,,,,1.8751567,0.0000535,YES,,
KLEDIVPSSHNCDVPHVNR,sno,C,80,false,"hot5-4 / wildtype, FAT-switch S-nitrosoproteome",169,37277371,,,,0.0892407,0.7126361,NO,,
LEDIVPSSHNCDVPHVNR,sno,C,80,false,"Site-specific nitrosomeproteomic id - gsnor1-3",90a,25699590,XCorr,3.3076959,,,,,6.5849999373313E-6,-4.8818223
LEDIVPSSHNCDVPHVNR,sno,C,80,false,"Site-specific nitrosomeproteomic id - gsnor1-3",90b,25699590,XCorr,3.6000000,,,,,0.031099999323487,-5.6600000
LEDIVPSSHNCDVPHVNR,sno,C,80,false,"hot5-4 / wildtype, FAT-switch S-nitrosoproteome",169,37277371,,,,,,,,
KLEDIVPSSHNCDVPHVNR,so,C,80,false,"S-sulfenylation site detection using YAP1C",110,32714340,,,,,,,,
LEDIVPSSHNCDVPHVNR,so,C,80,false,"Arabidopsis S-sulfenylation chemoproteomics",108,31578252,"pFind PSM Score",0.0015716,,1.4418200,,,,0.4560853
DDGLTAQMRLGF,nt,D,119,true,"Arabidopsis translation initiation landscape - NT",167b,35069635,,,,,,,,
SSMGEEQICAVKEVGGGK,nt,S,142,true,"Arabidopsis translation initiation landscape - NT",167b,35069635,,,,,,,,
LGFDEGKDIVVSVMSSMGEEQICAVKEVGGGK,so,C,150,true,"S-sulfenylation site detection using YAP1C",110,32714340,,,,,,,,
