Peptide,PTM,ModifiedAA,ModifiedPosition,PeptideUniqueToGene,ExperimentDesc,ExpID,PubmedID,ScoreType,IdentScore,LocProb,Log2FChange,PQ-val,QuantSig,PEP,MassErrorPPM
LSTIGGGYVMPTPMESSSPR,ph,S,376,true,"Tissue atlas Arabidopsis - ProteomicsDB",114,32188942,"MaxQuant score",195.4600000,0.8271930,,,,0,
SDSALLK,ph,S,381,true,"Plasmembrane Ph Immune Responses",25,17651370,,,,,,,,
TQSSAPLVGNR,ph,S,388,true,"Tissue atlas Arabidopsis - ProteomicsDB",114,32188942,"MaxQuant score",156.3600000,0.9984220,,,,1.7867700374818E-10,
TQSSAPLVGNR,ph,S,389,true,"Tissue atlas Arabidopsis - ProteomicsDB",114,32188942,"MaxQuant score",109.7200000,0.9941160,,,,3.4348900953773E-5,
TYLSQSEPGGFGQSR,ph,S,414,true,"Phosphorylation Early Elicitor Signaling",23,17317660,,,,,,,,
TYLSQSEPGGFGQSR,ph,S,414,true,"atm and atr DNA damage response",88,25561503,"MASCOT Score",64.0000000,1.0000000,,,,,-0.1200000
TYLSQSEPGGFGQSR,ph,S,414,true,"Tissue atlas Arabidopsis - ProteomicsDB",114,32188942,"MaxQuant score",276.1400000,1.0000000,,,,0,
LALDCNTHITTR,ph,T,587,false,"Tissue atlas Arabidopsis - ProteomicsDB",114,32188942,"MaxQuant score",70.1970000,0.8063130,,,,0.0019168299622834,
MAFGSQNYSTDSLTR,ph,S,742,true,"Phosphorylation Early Elicitor Signaling",23,17317660,,,,,,,,
MAFGSQNYSTDSLTR,ph,S,742,true,"atm and atr DNA damage response",88,25561503,"MASCOT Score",55.0000000,0.9940000,,,,,0.2900000
MAFGSQNYSTDSLTR,ph,S,742,true,"Tissue atlas Arabidopsis - ProteomicsDB",114,32188942,"MaxQuant score",235.8800000,1.0000000,,,,0,
MAFGSQNYSTDSLTR,ph,S,749,true,"atm and atr DNA damage response",88,25561503,"MASCOT Score",55.0000000,0.9940000,,,,,0.2900000
MAFGSQNYSTDSLTR,ph,S,749,true,"TOR Kinase and ABA Receptor",100,29290610,XCorr,3.8611195,0.7735000,,,,0.0064130001701415,
MAFGSQNYSTDSLTR,ph,S,749,true,"Tissue atlas Arabidopsis - ProteomicsDB",114,32188942,"MaxQuant score",287.0300000,0.9815970,,,,0,
