Peptide,PTM,ModifiedAA,ModifiedPosition,PeptideUniqueToGene,ExperimentDesc,ExpID,PubmedID,ScoreType,IdentScore,LocProb,Log2FChange,PQ-val,QuantSig,PEP,MassErrorPPM
AMVDEPLYPIAVLIDE,nt,A,2,true,"Arg/N-end rule seed, prt6 vs. Wt",99,29168982,"MASCOT Score",28.7700000,,,,,0.00017299999308307,-4.9078889
AMVDEPLYPI,nt,A,2,true,"N-term acetylation drought responses",5,26184543,,,,,,,,
AMVDEPLYPIAVLIDELKNDDIQLR,nta,A,2,true,"Arabidopsis translation initiation landscape - NTA",167a,35069635,,,,,,,,
AMVDEPLYPIAVLIDE,nta,A,2,true,"Arg/N-end rule seed, prt6 vs. Wt",99,29168982,"MASCOT Score",28.7700000,,,,,0.00017299999308307,-4.9078889
AMVDEPLYPI,nta,A,2,true,"N-term acetylation drought responses",5,26184543,,,,,,,,
AVESLCK,ox,C,111,true,"OxiTRAQ Arabidopsis - 5 mM H2O2 versus control",47,24376095,,,,0.1644759,0.0427093,NO,,
AVESLCK,sno,C,111,true,"hot5-4 / wildtype, FAT-switch S-nitrosoproteome",169,37277371,,,,0.1214941,0.0361566,NO,,
ATYSQLCK,so,C,172,true,"Arabidopsis S-sulfenylation chemoproteomics",108,31578252,"pFind PSM Score",0.1681450,,,,,,0.7171948
LLAVEGCAALGK,sno,C,226,false,"hot5-4 / wildtype, FAT-switch S-nitrosoproteome",169,37277371,,,,,,,,
LLAVEGCAALGK,so,C,226,false,"Arabidopsis S-sulfenylation chemoproteomics",108,31578252,"pFind PSM Score",0.0000585,,0.9218800,,,,-0.9444774
LLAVEGCAALGK,so,C,226,false,"S-sulfenylation site detection using YAP1C",110,32714340,,,,,,,,
LLEPQDCVAR,ox,C,238,true,"OxiTRAQ Arabidopsis - 5 mM H2O2 versus control",47,24376095,,,,0.3741345,0.0052831,NO,,
LLEPQDCVAR,ox,C,238,true,"SPEAR - 10 mM H2O2 / mock",138a,34619326,,,,-1.6471432,0.0335303,YES,,
LLEPQDCVAR,sno,C,238,true,"Site-specific nitrosomeproteomic id - gsnor1-3",90a,25699590,XCorr,2.3743453,,,,,0.0065660001710057,-6.7163487
LLEPQDCVAR,sno,C,238,true,"hot5-4 / wildtype, FAT-switch S-nitrosoproteome",169,37277371,,,,0.0155104,0.9224114,NO,,
LLEPQDCVAR,so,C,238,true,"S-sulfenylation site detection using YAP1C",110,32714340,,,,,,,,
ILPVIVNFSQDKSWR,ub,K,253,false,"upl3 mutant / wildtype",168,35926874,"MaxQuant score",101.3000000,1.0000000,0.8519988,0.0156178,YES,1.0182999687913E-7,-0.9165100
LLNPELAIQHILPCVK,ox,C,323,true,"OxiTRAQ SA and flg22 responses - SA vs mock",91a,25720653,"MASCOT Score",24.5100000,,0.8237494,0.0020000,YES,,
LLNPELAIQHILPCVK,ox,C,323,true,"OxiTRAQ SA and flg22 responses - flg22 vs mock",91b,25720653,"MASCOT Score",24.5100000,,0.6322682,0.0900000,NO,,
LLNPELAIQHILPCVK,sno,C,323,true,"Site-specific nitrosomeproteomic id - gsnor1-3",90b,25699590,XCorr,3.1300000,,,,,0.0019189999438822,-6.0700000
LGALCMQWLQDK,ox,C,441,false,"SPEAR - 10 mM H2O2 / mock",138a,34619326,,,,3.3904925,0.0000741,YES,,
LGALCMQWLQDK,ox,C,441,false,"SPEAR - 50 mM H2O2 / mock",138b,34619326,,,,3.5828326,0.0000730,YES,,
LGALCMQWLQDK,so,C,441,false,"Arabidopsis S-sulfenylation chemoproteomics",108,31578252,"pFind PSM Score",0.0320033,,0.9009000,,,,-0.7011517
EAAANNLKR,ac,K,461,false,"Quantitative Acetylproteomics",101,29440448,,,,,,,,
EAAANNLKR,ub,K,461,false,"Arabidopsis ubiquitination COFRADIC",40,26744219,"MaxQuant Score",80.4380000,1.0000000,,,,0.0089999996125698,-0.6830000
AISLMAPVMGSEITCSK,sno,C,512,true,"hot5-4 / wildtype, FAT-switch S-nitrosoproteome",169,37277371,,,,,,,,
QCLVDLSEDPDVDVR,nt,Q,556,true,"HUNTER N-terminome: legumain, GluC and trypsin",119,31951383,"MaxQuant score",112.4300000,,,,,,
QCLVDLSEDPDVDVR,sno,C,557,true,"hot5-4 / wildtype, FAT-switch S-nitrosoproteome",169,37277371,,,,0.6042427,0.0005519,YES,,
QCLVDLSEDPDVDVR,so,C,557,true,"S-sulfenylation site detection using YAP1C",110,32714340,,,,,,,,
