Peptide,PTM,ModifiedAA,ModifiedPosition,PeptideUniqueToGene,ExperimentDesc,ExpID,PubmedID,ScoreType,IdentScore,LocProb,Log2FChange,PQ-val,QuantSig,PEP,MassErrorPPM
SLPLLECKYVTEEFVR,nta,S,2,true,"Arg/N-end rule pathway Roots",80,25728785,"MASCOT Score",56.7000000,,,,,2.3770000552759E-5,
LAPLNPVAHDQICSGLFR,ox,C,389,true,"SPEAR - 50 mM H2O2 / mock",138b,34619326,,,,-2.3514013,0.0146712,YES,,
FQSSSSASTVKLTPTANTTANR,ph,T,424,true,"Tissue atlas Arabidopsis - ProteomicsDB",114,32188942,"MaxQuant score",229.9800000,0.9997680,,,,0,
APPVHTPK,ph,T,1233,true,"atm and atr DNA damage response",88,25561503,"MASCOT Score",30.0000000,1.0000000,,,,,-4.0000000
TESIPSKSDQGHLK,ph,S,1290,true,"atm and atr DNA damage response",88,25561503,"MASCOT Score",32.0000000,0.9960000,,,,,-1.4300000
TESIPSKSDQGHLK,ph,S,1290,true,"Tissue atlas Arabidopsis - ProteomicsDB",114,32188942,"MaxQuant score",141.1300000,0.9983580,,,,1.1639100421235E-6,
GGNPLDSQPSISKK,ph,S,1308,true,"atm and atr DNA damage response",88,25561503,"MASCOT Score",42.0000000,1.0000000,,,,,-2.0800000
GGNPLDSQPSISKK,ph,S,1308,true,"Tissue atlas Arabidopsis - ProteomicsDB",114,32188942,"MaxQuant score",131.3600000,0.9884580,,,,7.7635398554321E-8,
GGNPLDSQPSISK,ph,S,1308,true,"TOR Kinase and ABA Receptor",100,29290610,XCorr,3.0406787,0.8945000,,,,0.0061460002325475,
SMEQKETDETPR,nt,S,1313,true,"Metacaspase9 substrates - in vitro rMC9",51c,23964026,"MASCOT Score",41.0000000,,,,,,0.0000000
ETDETPRISDENPVKPASK,ph,T,1322,true,"Tissue atlas Arabidopsis - ProteomicsDB",114,32188942,"MaxQuant score",70.3450000,0.8506400,,,,0.0001770469971234,
ETDETPRISDENPVKPASK,ph,S,1326,true,"Phospho cell culture sucrose/TOR",109,30833711,,,0.9550820,,,,,
ETDETPRISDENPVKPASK,ph,S,1326,true,"Tissue atlas Arabidopsis - ProteomicsDB",114,32188942,"MaxQuant score",317.8500000,0.9999940,,,,0,
TSTADKDLNYLESR,ph,T,1376,true,"LAXIC - mannitol vs control",84b,23660473,XCorr,3.5500000,0.8840000,,,,5.6400001335888E-10,
TSTADKDLNYLESR,ph,T,1376,true,"SnRK2 protein kinase substrates",85,23776212,XCorr,3.0497277,0.9390000,,,,3.0320100596892E-11,
TSTADKDLNYLESR,ph,T,1376,true,"atm and atr DNA damage response",88,25561503,"MASCOT Score",35.0000000,0.9550000,,,,,-0.2200000
TSTADKDLNYLESR,ph,T,1376,true,"Tissue atlas Arabidopsis - ProteomicsDB",114,32188942,"MaxQuant score",241.6600000,0.9998480,,,,0,
ALSSTAANGSIATGSSK,ph,S,1396,true,"Tissue atlas Arabidopsis - ProteomicsDB",114,32188942,"MaxQuant score",250.9400000,0.9979050,,,,0,
TVHSPRHEIVTSVR,ph,T,1428,true,"TOR Kinase and ABA Receptor",100,29290610,XCorr,2.9151371,0.8847000,,,,0.00042379999649711,
TVHSPRHEIVTSVR,ph,S,1431,true,"srk2dei ABA signaling phopshoproteomics",83,23572148,"MASCOT Score",35.0000000,,,,,,0.0007000
TVHSPRHEIVTSVR,ph,S,1431,true,"Tissue atlas Arabidopsis - ProteomicsDB",114,32188942,"MaxQuant score",157.9800000,0.9999990,,,,6.1891700098293E-11,
SSDRLQKR,ph,S,1442,true,"Phosphorylation Early Elicitor Signaling",23,17317660,,,,,,,,
SSDRLQKR,ph,S,1443,true,"Phosphorylation Early Elicitor Signaling",23,17317660,,,,,,,,
SSDRDRSVEAR,ph,S,1484,true,"atm and atr DNA damage response",88,25561503,"MASCOT Score",20.0000000,1.0000000,,,,,-0.1200000
SVEKGLDKGTTR,ph,S,1551,true,"STN8 phosphoproteome",38,21768351,"MASCOT Score",48.2000000,,,,,,-3.1103500
HSEASLEK,ph,S,1585,true,"atm and atr DNA damage response",88,25561503,"MASCOT Score",30.0000000,1.0000000,,,,,-2.3300000
HSQRLSPR,ph,S,1635,true,"atm and atr DNA damage response",88,25561503,"MASCOT Score",31.0000000,1.0000000,,,,,-0.1100000
RRSEENLSVSVDDAK,ph,S,1646,true,"Arabidopsis root NAA phosphoproteome",18a,27643528,"MaxQuant Score",58.8480000,0.9890000,,,,3.7689998862334E-5,-0.8570000
RRSEENLSVSVDDAK,ph,S,1646,true,"Tyrosine phosphorylation in Arabidopsis",59,18463617,"MASCOT Score",45.0000000,,,,,,-0.8408973
RRSEENLSVSVDDAK,ph,S,1646,true,"Chloroplast kinase substrates",60,19376835,"MASCOT Score",69.2500000,,,,,,0.7662090
RRSEENLSVSVDDAK,ph,S,1646,true,"Conserved plant phosphoproteome - Arabidopsis",61a,20466843,"MASCOT Score",61.0000000,1.0000000,,,,,
RRSEENLSVSVDDAK,ph,S,1646,true,"srk2dei ABA signaling phopshoproteomics",83,23572148,"MASCOT Score",72.0000000,,,,,,-0.0009000
RRSEENLSVSVDDAK,ph,S,1646,true,"LAXIC - mannitol vs control",84b,23660473,XCorr,3.9700000,1.0000000,-1.2816602,,NO,0.00023073899501469,
RRSEENLSVSVDDAK,ph,S,1646,true,"SnRK2 protein kinase substrates",85,23776212,XCorr,3.4753251,1.0000000,,,,0.00090600398834795,
RRSEENLSVSVDDAK,ph,S,1646,true,"atm and atr DNA damage response",88,25561503,"MASCOT Score",45.0000000,1.0000000,,,,,-0.7400000
RRSEENLSVSVDDAK,ph,S,1646,true,"TOR Kinase and ABA Receptor",100,29290610,XCorr,4.6168909,1.0000000,,,,1.0730000212789E-6,
RRSEENLSVSVDDAK,ph,S,1646,true,"Phospho cell culture sucrose/TOR",109,30833711,,,0.9999220,,,,,
RRSEENLSVSVDDAK,ph,S,1646,true,"Touch-induced phosphorylation: 40s touch vs untouc",136,30291188,"MASCOT score",61.6100000,,-0.1460060,0.0589326,NO,,-3.3060870
SEENLSVSVDDAKR,ph,S,1646,true,"STN8 phosphoproteome",38,21768351,"MASCOT Score",72.8400000,,,,,,-0.7905530
SEENLSVSVDDAKR,ph,S,1646,true,"Chloroplast kinase substrates",60,19376835,"MASCOT Score",72.0900000,,,,,,-1.0850800
SEENLSVSVDDAKR,ph,S,1646,true,"Col-0 callus - FC Col-0 vs. Col-0 Xray",111a,31410901,,44.1500000,,0.3462457,0.0000000,NO,,1.2901603
SEENLSVSVDDAKR,ph,S,1646,true,"Col-0 X-ray callus - FC Col-0 vs. Col-0 Xray",111b,31410901,,44.1500000,,0.3462457,0.0000000,NO,,1.2901603
SEENLSVSVDDAKR,ph,S,1646,true,"atm callus - FC atm vs. atm Xray",111c,31410901,,44.1500000,,-0.1999798,0.0000000,NO,,1.2901603
SEENLSVSVDDAKR,ph,S,1646,true,"atm-3 X-ray callus - FC atm vs. atm Xray",111d,31410901,,44.1500000,,-0.1999798,0.0000000,NO,,1.2901603
SEENLSVSVDDAKR,ph,S,1646,true,"Tissue atlas Arabidopsis - ProteomicsDB",114,32188942,"MaxQuant score",198.8500000,1.0000000,,,,7.4216199412612E-31,
RSEENLSVSVDDAK,ph,S,1646,true,"Chloroplast kinase substrates",60,19376835,"MASCOT Score",64.9800000,,,,,,-1.5636900
RSEENLSVSVDDAK,ph,S,1646,true,"LAXIC - mannitol vs control",84b,23660473,XCorr,3.4200000,1.0000000,,,,0.021829899400473,
RSEENLSVSVDDAK,ph,S,1646,true,"SnRK2 protein kinase substrates",85,23776212,XCorr,2.6689248,0.9900000,,,,0.013463100418448,
RSEENLSVSVDDAK,ph,S,1646,true,"atm and atr DNA damage response",88,25561503,"MASCOT Score",33.0000000,1.0000000,,,,,-0.4000000
SEENLSVSVDDAK,ph,S,1646,true,"STN8 phosphoproteome",38,21768351,"MASCOT Score",98.2800000,,,,,,-1.0853400
SEENLSVSVDDAK,ph,S,1646,true,"Chloroplast kinase substrates",60,19376835,"MASCOT Score",75.3100000,,,,,,-0.4474570
SEENLSVSVDDAK,ph,S,1646,true,"srk2dei ABA signaling phopshoproteomics",83,23572148,"MASCOT Score",59.0000000,,,,,,0.0010000
SEENLSVSVDDAK,ph,S,1646,true,"LAXIC - mannitol vs control",84b,23660473,XCorr,2.5300000,1.0000000,,,,0.010444399900734,
EKSLPLKEDFEASK,ph,S,1696,true,"Phosphoproteome ethylene-regulated time response",46,24043427,"MASCOT Score",45.9500000,,,,,,-12.2489000
EKSLPLKEDFEASK,ph,S,1696,true,"SnRK2 protein kinase substrates",85,23776212,XCorr,2.3729360,1.0000000,,,,0.049345601350069,
EKSLPLKEDFEASK,ph,S,1696,true,"Phospho cell culture sucrose/TOR",109,30833711,,,1.0000000,,,,,
SLPLKEDFEASKR,ph,S,1696,true,"Tissue atlas Arabidopsis - ProteomicsDB",114,32188942,"MaxQuant score",179.4600000,1.0000000,,,,4.5480699484243E-23,
SLPLKEDFEASKR,ph,S,1696,true,"Touch-induced phosphorylation: 40s touch vs untouc",136,30291188,"MASCOT score",62.4400000,,-0.3107015,0.6534631,NO,,4.0420315
SLPLKEDFEASK,ph,S,1696,true,"STN8 phosphoproteome",38,21768351,"MASCOT Score",55.5600000,,,,,,0.0412669
SLPLKEDFEASK,ph,S,1696,true,"Chloroplast kinase substrates",60,19376835,"MASCOT Score",56.0500000,,,,,,0.0412669
SLPLKEDFEASK,ph,S,1696,true,"atm and atr DNA damage response",88,25561503,"MASCOT Score",36.0000000,1.0000000,,,,,0.1900000
SLPLKEDFEASK,ph,S,1696,true,"Touch-induced phosphorylation: 40s touch vs untouc",136,30291188,"MASCOT score",61.7800000,,-0.0799046,0.4827877,NO,,3.4908051
EQQVPSAEPGEYSPMPHHSSLSTSMGPSSYEGR,ph,S,1719,true,"Tissue atlas Arabidopsis - ProteomicsDB",114,32188942,"MaxQuant score",99.8660000,0.9911220,,,,1.9432099425161E-25,
REQQVPSAEPGEYSPMPHHSSLSTSMGPSSYEGR,ph,S,1726,true,"TOR Kinase and ABA Receptor",100,29290610,XCorr,4.7873216,0.9656000,,,,4.2479998228373E-5,
EQQVPSAEPGEYSPMPHHSSLSTSMGPSSYEGR,ph,S,1726,true,"Tissue atlas Arabidopsis - ProteomicsDB",114,32188942,"MaxQuant score",163.7100000,0.9991650,,,,0,
