Peptide,PTM,ModifiedAA,ModifiedPosition,PeptideUniqueToGene,ExperimentDesc,ExpID,PubmedID,ScoreType,IdentScore,LocProb,Log2FChange,PQ-val,QuantSig,PEP,MassErrorPPM
ALAFDEFGRPFIILR,nt,A,2,false,"Stromal N-terminome",96,26371235,"MASCOT Score",57.8900000,,,,,,
ALAFDEFGRPF,nt,A,2,false,"Arg/N-end rule seed, prt6 vs. Wt",99,29168982,"MASCOT Score",28.5000000,,,,,0.10859999805689,-3.8141523
ALAFDEFGRP,nt,A,2,false,"N-term acetylation drought responses",5,26184543,,,,,,,,
ALAFDEFGR,nt,A,2,false,"Arg/N-end rule seed, prt6 vs. Wt",99,29168982,"MASCOT Score",58.9300000,,,,,0.048749998211861,0.4351972
ALAFDEFGRPFIILR,nta,A,2,false,"Characterization plant N-terminal acetylation",6,22223895,"MASCOT Score",37.9500000,,,,,,
ALAFDEFGRPFIILR,nta,A,2,false,"Stromal N-terminome",96,26371235,"MASCOT Score",57.8900000,,,,,,
ALAFDEFGRPFIILR,nta,A,2,false,"HUNTER N-terminome: legumain, GluC and trypsin",119,31951383,"MaxQuant score",55.8410000,,,,,,
ALAFDEFGRPFIILR,nta,A,2,false,"Arabidopsis translation initiation landscape - NTA",167a,35069635,,,,,,,,
ALAFDEFGRPF,nta,A,2,false,"Arg/N-end rule pathway Roots",80,25728785,"MASCOT Score",54.4000000,,,,,0.0014090000186116,
ALAFDEFGRPF,nta,A,2,false,"Arg/N-end rule seed, prt6 vs. Wt",99,29168982,"MASCOT Score",28.5000000,,,,,0.10859999805689,-3.8141523
ALAFDEFGRP,nta,A,2,false,"N-term acetylation drought responses",5,26184543,,,,,,,,
ALAFDEFGR,nta,A,2,false,"Arg/N-end rule seed, prt6 vs. Wt",99,29168982,"MASCOT Score",58.9300000,,,,,0.048749998211861,0.4351972
QIEDAHIAILTCPFEPPKPK,ox,C,249,true,"SPEAR - 50 mM H2O2 / mock",138b,34619326,,,,2.4715618,0.0007166,YES,,
QIEDAHIAILTCPFEPPKPK,sno,C,249,true,"hot5-4 / wildtype, FAT-switch S-nitrosoproteome",169,37277371,,,,1.0720955,0.0014444,YES,,
QIEDAHIAILTCPFEPPKPK,so,C,249,true,"S-sulfenylation site detection using YAP1C",110,32714340,,,,,,,,
QEQQYFDEMVQKCK,so,C,288,true,"Arabidopsis S-sulfenylation chemoproteomics",108,31578252,"pFind PSM Score",0.0763962,,,,,,-1.2504756
FQELTPEKLGK,ph,T,345,true,"Tissue atlas Arabidopsis - ProteomicsDB",114,32188942,"MaxQuant score",155.5300000,1.0000000,,,,0.0040840897709131,
FQELTPEK,ph,T,345,true,"atm and atr DNA damage response",88,25561503,"MASCOT Score",21.0000000,1.0000000,,,,,-1.7200000
FQELTPEK,ph,T,345,true,"TOR Kinase and ABA Receptor",100,29290610,XCorr,2.2098591,1.0000000,,,,0.013939999975264,
FQELTPEK,ph,T,345,true,"Lateral root-induction - NAA vs control",106,23328941,"MASCOT Score",28.0000000,,,,,,
EKSFGTTK,ph,S,359,true,"atm and atr DNA damage response",88,25561503,"MASCOT Score",36.0000000,1.0000000,,,,,-2.7900000
MLYIEHCANSK,sno,C,373,true,"Site-specific nitrosomeproteomic id - gsnor1-3",90a,25699590,XCorr,2.8032725,,,,,0.00030819998937659,-4.9298680
MLYIEHCANSK,so,C,373,true,"Arabidopsis S-sulfenylation chemoproteomics",108,31578252,"pFind PSM Score",0.0005330,,1.5639300,,,,-1.4397105
MLYIEHCANSK,so,C,373,true,"S-sulfenylation site detection using YAP1C",110,32714340,,,,,,,,
MMIEETKR,ac,K,395,true,"Quantitative Acetylproteomics",101,29440448,,,,,,,,
SIHDALCVAR,nt,S,397,true,"N-terminal ChaFRADIC",92,26010716,"MASCOT Score",29.7900000,,,,,2.9389999326668E-5,
SIHDALCVAR,nt,S,397,true,"Arabidopsis translation initiation landscape - NT",167b,35069635,,,,,,,,
SIHDALCVAR,sno,C,403,true,"Site-specific nitrosomeproteomic id - gsnor1-3",90a,25699590,XCorr,2.0444806,,,,,0.097000002861023,-6.6978184
SIHDALCVAR,so,C,403,true,"Arabidopsis S-sulfenylation chemoproteomics",108,31578252,"pFind PSM Score",0.0061763,,0.9542900,,,,0.9902503
SIHDALCVAR,so,C,403,true,"S-sulfenylation site detection using YAP1C",110,32714340,,,,,,,,
NDVGTNDMR,nt,N,490,true,"Arg/N-end rule seed, prt6 vs. Wt",99,29168982,"MASCOT Score",27.6900000,,-1.8060838,0.0005285,YES,0.21220000088215,-1.1456345
