Peptide,PTM,ModifiedAA,ModifiedPosition,PeptideUniqueToGene,ExperimentDesc,ExpID,PubmedID,ScoreType,IdentScore,LocProb,Log2FChange,PQ-val,QuantSig,PEP,MassErrorPPM
SYSQDLAIVDR,ph,S,288,true,"Tissue atlas Arabidopsis - ProteomicsDB",114,32188942,"MaxQuant score",77.6330000,0.9978280,,,,0.0015956700081006,
TNSPIRVEDHLTALNLR,ph,S,525,true,"Tissue atlas Arabidopsis - ProteomicsDB",114,32188942,"MaxQuant score",156.7000000,0.9999990,,,,8.0988697909695E-17,
SGSSSAGESEGSPHNYASVADSR,ph,S,726,true,"Tissue atlas Arabidopsis - ProteomicsDB",114,32188942,"MaxQuant score",156.5200000,0.8778180,,,,6.0603005660504E-39,
SGSSSAGESEGSPHNYASVADSR,ph,S,727,true,"atm and atr DNA damage response",88,25561503,"MASCOT Score",25.0000000,0.8930000,,,,,0.1900000
SGSSSAGESEGSPHNYASVADSR,ph,S,727,true,"Tissue atlas Arabidopsis - ProteomicsDB",114,32188942,"MaxQuant score",100.9500000,0.9387150,,,,6.285349844759E-13,
SGSSSAGESEGSPHNYASVADSR,ph,S,731,true,"atm and atr DNA damage response",88,25561503,"MASCOT Score",25.0000000,1.0000000,,,,,0.1900000
SGSSSAGESEGSPHNYASVADSR,ph,S,734,true,"atm and atr DNA damage response",88,25561503,"MASCOT Score",25.0000000,0.9980000,,,,,0.1900000
SGSSSAGESEGSPHNYASVADSR,ph,S,734,true,"Tissue atlas Arabidopsis - ProteomicsDB",114,32188942,"MaxQuant score",195.5800000,0.9992640,,,,0,
KANEHSQLGQTSNSERDGAAGR,ph,S,765,true,"Tissue atlas Arabidopsis - ProteomicsDB",114,32188942,"MaxQuant score",143.5000000,0.9016990,,,,4.3832601098209E-33,
ANEHSQLGQTSNSERDGAAGR,ph,S,765,true,"TOR Kinase and ABA Receptor",100,29290610,XCorr,3.9434252,0.8704000,,,,0.00096440000925213,
TSDALCETAQHEK,ph,S,775,true,"atm and atr DNA damage response",88,25561503,"MASCOT Score",38.0000000,0.9510000,,,,,-0.1100000
NVVTSDEKPESK,ph,S,794,true,"Tissue atlas Arabidopsis - ProteomicsDB",114,32188942,"MaxQuant score",107.3700000,0.9966860,,,,0.00014097099483479,
LLTNGIAVEITSDQEMAGTSK,ph,S,880,true,"Tissue atlas Arabidopsis - ProteomicsDB",114,32188942,"MaxQuant score",198.6000000,0.9139690,,,,0,
VEREEGELSPNGDFEEDNFAVYAK,ph,S,898,true,"Arabidopsis root NAA phosphoproteome",18a,27643528,"MaxQuant Score",95.6540000,1.0000000,,,,1.9760000927183E-12,-0.5850000
VEREEGELSPNGDFEEDNFAVYAK,ph,S,898,true,"Conserved plant phosphoproteome - Arabidopsis",61a,20466843,"MASCOT Score",70.0000000,1.0000000,,,,,
VEREEGELSPNGDFEEDNFAVYAK,ph,S,898,true,"srk2dei ABA signaling phopshoproteomics",83,23572148,"MASCOT Score",73.0000000,,,,,,-0.0006000
VEREEGELSPNGDFEEDNFAVYAK,ph,S,898,true,"SnRK2 protein kinase substrates",85,23776212,XCorr,5.5511832,1.0000000,,,,8.7313101193587E-10,
VEREEGELSPNGDFEEDNFAVYAK,ph,S,898,true,"TOR Kinase and ABA Receptor",100,29290610,XCorr,4.9648509,1.0000000,,,,2.6260000595357E-5,
VEREEGELSPNGDFEEDNFAVYAK,ph,S,898,true,"Phospho cell culture sucrose/TOR",109,30833711,,,1.0000000,,,,,
VEREEGELSPNGDFEEDNFAVYAK,ph,S,898,true,"Tissue atlas Arabidopsis - ProteomicsDB",114,32188942,"MaxQuant score",432.5500000,1.0000000,,,,0,
EEGELSPNGDFEEDNFAVYAK,ph,S,898,true,"STN8 phosphoproteome",38,21768351,"MASCOT Score",93.1800000,,,,,,-0.8592330
EEGELSPNGDFEEDNFAVYAK,ph,S,898,true,"SnRK2 protein kinase substrates",85,23776212,XCorr,3.4639323,1.0000000,,,,0.0044431900605559,
EEGELSPNGDFEEDNFAVYAK,ph,S,898,true,"Col-0 callus - FC Col-0 vs. Col-0 Xray",111a,31410901,,99.1500000,,0.0481615,0.0000000,NO,,0.7003303
EEGELSPNGDFEEDNFAVYAK,ph,S,898,true,"Col-0 X-ray callus - FC Col-0 vs. Col-0 Xray",111b,31410901,,99.1500000,,0.0481615,0.0000000,NO,,0.7003303
EEGELSPNGDFEEDNFAVYAK,ph,S,898,true,"atm callus - FC atm vs. atm Xray",111c,31410901,,99.1500000,,1.6436209,0.0000000,NO,,0.7003303
EEGELSPNGDFEEDNFAVYAK,ph,S,898,true,"atm-3 X-ray callus - FC atm vs. atm Xray",111d,31410901,,99.1500000,,1.6436209,0.0000000,NO,,0.7003303
ANDSTGNNISGDR,ph,S,925,true,"atm and atr DNA damage response",88,25561503,"MASCOT Score",38.0000000,1.0000000,,,,,-0.0900000
ANDSTGNNISGDR,ph,S,925,true,"Tissue atlas Arabidopsis - ProteomicsDB",114,32188942,"MaxQuant score",201.1000000,0.9994260,,,,7.5461800246517E-32,
ANDSTGNNISGDR,ph,T,926,true,"SnRK2 protein kinase substrates",85,23776212,XCorr,2.2984319,0.9070000,,,,0.013335100375116,
ANDSTGNNISGDRSR,ph,S,931,true,"atm and atr DNA damage response",88,25561503,"MASCOT Score",24.0000000,1.0000000,,,,,-0.4300000
ANDSTGNNISGDR,ph,S,931,true,"atm and atr DNA damage response",88,25561503,"MASCOT Score",71.0000000,1.0000000,,,,,-0.1500000
ANDSTGNNISGDR,ph,S,931,true,"Tissue atlas Arabidopsis - ProteomicsDB",114,32188942,"MaxQuant score",190.3900000,1.0000000,,,,3.2372900011476E-30,
ANDSTGNNISGDRSR,ph,S,935,true,"atm and atr DNA damage response",88,25561503,"MASCOT Score",36.0000000,1.0000000,,,,,-0.4700000
ANDSTGNNISGDRSR,ph,S,935,true,"Tissue atlas Arabidopsis - ProteomicsDB",114,32188942,"MaxQuant score",108.2500000,0.9503230,,,,1.6338999557775E-6,
EGEPSCLETR,ph,S,941,true,"Tissue atlas Arabidopsis - ProteomicsDB",114,32188942,"MaxQuant score",60.4900000,0.9992330,,,,0.01315230038017,
GESEGEAECMADAHDAEENGSALPVSAR,ph,S,996,true,"srk2dei ABA signaling phopshoproteomics",83,23572148,"MASCOT Score",51.0000000,,,,,,-0.0013000
GESEGEAECMADAHDAEENGSALPVSAR,ph,S,996,true,"Tissue atlas Arabidopsis - ProteomicsDB",114,32188942,"MaxQuant score",336.8000000,1.0000000,,,,0,
