Peptide,PTM,ModifiedAA,ModifiedPosition,PeptideUniqueToGene,ExperimentDesc,ExpID,PubmedID,ScoreType,IdentScore,LocProb,Log2FChange,PQ-val,QuantSig,PEP,MassErrorPPM
GLSGVLHVEVE,nt,G,2,true,"N-terminal ChaFRADIC",92,26010716,"MASCOT Score",25.9800000,,,,,0.0047450000420213,
GLSGVLHVE,nt,G,2,true,"N-terminal ChaFRADIC",92,26010716,"MASCOT Score",38.3900000,,,,,0.0061499997973442,
GLSGVLHVE,nt,G,2,true,"Arg/N-end rule seed, prt6 vs. Wt",99,29168982,"MASCOT Score",41.7800000,,-0.4871556,0.0353598,NO,0.0013820000458509,-2.2091967
GLSGVLHVE,nt,G,2,true,"HUNTER N-terminome: legumain, GluC and trypsin",119,31951383,"MaxQuant score",101.4100000,,,,,,
GLSGVLH,nt,G,2,true,"Arg/N-end rule seed, prt6 vs. Wt",99,29168982,"MASCOT Score",48.2500000,,-0.5028713,0.5168556,NO,0.15510000288486,-1.0913308
GLSGVLHVEVE,nta,G,2,true,"N-terminal ChaFRADIC",92,26010716,"MASCOT Score",25.9800000,,,,,0.0047450000420213,
GLSGVLHVE,nta,G,2,true,"N-terminal ChaFRADIC",92,26010716,"MASCOT Score",33.5200000,,,,,0.0086310002952814,
GLSGVLHVE,nta,G,2,true,"Arg/N-end rule seed, prt6 vs. Wt",99,29168982,"MASCOT Score",34.2200000,,,,,0.052030000835657,-2.8751734
AFPNDYKTIQVLAGDGNAPGSIR,cr,K,40,true,"Open search Plant PTM Viewer 2.0 - Crotonylation",164c,TBA,,,,,,,,
AFPNDYKTIQVLAGDGNAPGSIR,ub,K,40,true,"upl3 mutant / wildtype",168,35926874,"MaxQuant score",45.7370000,1.0000000,0.4265331,0.1487600,NO,0.00057439302327111,0.4150400
VLAGDGNAPGSIR,nt,V,44,true,"Tic56 chloroplast import - tic56-1",89c,25588737,XCorr,2.4532270,,,,,,
LITYGEGSPLVK,ph,S,64,true,"atm and atr DNA damage response",88,25561503,"MASCOT Score",34.0000000,1.0000000,,,,,-1.9700000
LITYGEGSPLVK,ph,S,64,true,"Tissue atlas Arabidopsis - ProteomicsDB",114,32188942,"MaxQuant score",131.3200000,0.9999960,,,,3.3805601560744E-5,
LITYGEGSPLVKISAER,ub,K,68,true,"upl3 mutant / wildtype",168,35926874,"MaxQuant score",124.2900000,1.0000000,1.2545940,0.2528600,NO,2.270529986248E-9,0.9387500
TFKGTITVIPK,ub,K,101,true,"upl3 mutant / wildtype",168,35926874,"MaxQuant score",54.6500000,1.0000000,0.6059684,0.2040600,NO,0.0026611899957061,0.6142200
GTITVIPKDGGSLLK,hib,K,109,true,"Open search Plant PTM Viewer 2.0 - hib",164e,TBA,,,,,,,,
DGGSLLKWSGEFEK,cr,K,116,true,"Open search Plant PTM Viewer 2.0 - Crotonylation",164c,TBA,,,,,,,,
DGGSLLKWSGEFEK,ph,S,118,true,"srk2dei ABA signaling phopshoproteomics",83,23572148,"MASCOT Score",23.0000000,,,,,,0.0013000
DGGSLLKWSGEFEK,ph,S,118,true,"Tissue atlas Arabidopsis - ProteomicsDB",114,32188942,"MaxQuant score",57.7940000,0.9999660,,,,0.010133099742234,
TAHEIDDPHVIKDFAVK,cr,K,135,true,"Open search Plant PTM Viewer 2.0 - Crotonylation",164c,TBA,,,,,,,,
TAHEIDDPHVIKDFAVK,hib,K,135,true,"Open search Plant PTM Viewer 2.0 - hib",164e,TBA,,,,,,,,
DFAVKNFK,ac,K,140,true,"Quantitative Acetylproteomics",101,29440448,,,,,,,,
TAHEIDDPHVIKDFAVKNFK,cr,K,140,true,"Open search Plant PTM Viewer 2.0 - Crotonylation",164c,TBA,,,,,,,,
NFKEIDEYLLK,cr,K,143,true,"Open search Plant PTM Viewer 2.0 - Crotonylation",164c,TBA,,,,,,,,
NFKEIDEYLLK,hib,K,143,true,"Open search Plant PTM Viewer 2.0 - hib",164e,TBA,,,,,,,,
NFKEIDEYLLKQTSA,ph,T,153,true,"MAPK Arabidopsis substrates",45,23172892,"MaxQuant Score",101.5300000,,,,,,
NFKEIDEYLLKQTSA,ph,S,154,true,"MAPK Arabidopsis substrates",45,23172892,"MaxQuant Score",125.2200000,,,,,,
