Peptide,PTM,ModifiedAA,ModifiedPosition,PeptideUniqueToGene,ExperimentDesc,ExpID,PubmedID,ScoreType,IdentScore,LocProb,Log2FChange,PQ-val,QuantSig,PEP,MassErrorPPM
VSRSCANFLD,nt,V,2,false,"Arg/N-end rule seed, prt6 vs. Wt",99,29168982,"MASCOT Score",43.3900000,,,,,0.00031810000655241,-1.4949667
VSRSCANFLD,nta,V,2,false,"Arg/N-end rule seed, prt6 vs. Wt",99,29168982,"MASCOT Score",43.3900000,,,,,0.00031810000655241,-1.4949667
TVPGIISELDGGYSDGSSDVNSSNSSR,nt,T,32,true,"Arg/N-end rule seed, prt6 vs. Wt",99,29168982,"MASCOT Score",76.8300000,,1.9824286,0.0018636,YES,0.00010130000009667,-1.0837017
TVPGIISE,nt,T,32,true,"N-terminal ChaFRADIC",92,26010716,"MASCOT Score",36.6300000,,,,,0.045719999819994,
KETYSTAK,ph,S,395,true,"Sucrose-induced phosphorylation",24,17586839,,,,,,,,
VLSLSPSFR,ph,S,569,false,"atm and atr DNA damage response",88,25561503,"MASCOT Score",30.0000000,0.9940000,,,,,-0.0300000
VLSLSPSFR,ph,S,569,false,"Tissue atlas Arabidopsis - ProteomicsDB",114,32188942,"MaxQuant score",138.2200000,0.9999740,,,,9.2943402705714E-5,
VLSLSPSFRK,ph,S,571,false,"Tissue atlas Arabidopsis - ProteomicsDB",114,32188942,"MaxQuant score",195.2700000,0.9986020,,,,1.5852000267991E-10,
VLSLSPSFRK,ph,S,573,false,"Arabidopsis root NAA phosphoproteome",18a,27643528,"MaxQuant Score",125.8200000,1.0000000,,,,2.8970000130357E-5,0.2130000
VLSLSPSFRK,ph,S,573,false,"Phosphoproteome ethylene-regulated time response",46,24043427,"MASCOT Score",61.0800000,,,,,,5.9314000
VLSLSPSFRK,ph,S,573,false,"PAMP-triggered phosphorylation",48,24601666,"MASCOT Score",39.0400000,,,,,,
VLSLSPSFRK,ph,S,573,false,"atm and atr DNA damage response",88,25561503,"MASCOT Score",45.0000000,1.0000000,,,,,0.2900000
VLSLSPSFRK,ph,S,573,false,"Phospho cell culture sucrose/TOR",109,30833711,,,0.9990960,,,,,
VLSLSPSFR,ph,S,573,false,"Large-scale phosphorylation discovery",44,23111157,XCorr,3.2870000,,,,,,
VLSLSPSFR,ph,S,573,false,"PAMP-triggered phosphorylation",48,24601666,"MASCOT Score",50.5000000,,,,,,
VLSLSPSFR,ph,S,573,false,"srk2dei ABA signaling phopshoproteomics",83,23572148,"MASCOT Score",34.0000000,,,,,,-0.0013000
VLSLSPSFR,ph,S,573,false,"atm and atr DNA damage response",88,25561503,"MASCOT Score",51.0000000,1.0000000,,,,,1.3600000
VLSLSPSFR,ph,S,573,false,"TOR Kinase and ABA Receptor",100,29290610,XCorr,3.4660368,0.9995000,,,,0.00014139999984764,
VLSLSPSFR,ph,S,573,false,"Lateral root-induction - NAA vs control",106,23328941,"MASCOT Score",35.0000000,,,,,,
VLSLSPSFR,ph,S,573,false,"Col-0 callus - FC Col-0 vs. Col-0 Xray",111a,31410901,,31.5700000,,-0.4545954,0.0000000,NO,,4.8349195
VLSLSPSFR,ph,S,573,false,"Col-0 X-ray callus - FC Col-0 vs. Col-0 Xray",111b,31410901,,31.5700000,,-0.4545954,0.0000000,NO,,4.8349195
VLSLSPSFR,ph,S,573,false,"atm callus - FC atm vs. atm Xray",111c,31410901,,31.5700000,,-1.1528249,0.0000000,NO,,4.8349195
VLSLSPSFR,ph,S,573,false,"atm-3 X-ray callus - FC atm vs. atm Xray",111d,31410901,,31.5700000,,-1.1528249,0.0000000,NO,,4.8349195
VLSLSPSFR,ph,S,573,false,"Tissue atlas Arabidopsis - ProteomicsDB",114,32188942,"MaxQuant score",218.1100000,0.9999970,,,,4.3337099347493E-23,
VLSLSPSFR,ph,S,573,false,"Touch-induced phosphorylation: 40s touch vs untouc",136,30291188,"MASCOT score",66.0200000,,-0.0362437,0.8503397,NO,,7.0864666
