Peptide,PTM,ModifiedAA,ModifiedPosition,PeptideUniqueToGene,ExperimentDesc,ExpID,PubmedID,ScoreType,IdentScore,LocProb,Log2FChange,PQ-val,QuantSig,PEP,MassErrorPPM
MDAKETSATDLKRPREEDDN,nta,M,1,true,"HUNTER N-terminome: legumain, GluC and trypsin",119,31951383,"MaxQuant score",,,,,,,
MDAKETSATDLKRPR,nta,M,1,true,"Arg/N-end rule pathway Roots",80,25728785,"MASCOT Score",45.2300000,,,,,0.00060869997832924,
MDAKETSATDLKRPR,nta,M,1,true,"FtsH12 N-terminome: WT / FtsH12 knockdown miRNA",118,33216923,"MaxQuant score",69.8150000,,,,,0.014458999969065,
MDAKETSATDLKRPR,nta,M,1,true,"HUNTER N-terminome: legumain, GluC and trypsin",119,31951383,"MaxQuant score",92.4570000,,,,,,
MDAKETSATDLKR,nta,M,1,true,"Arabidopsis translation initiation landscape - NTA",167a,35069635,,,,,,,,
MDAKETSATDLK,ph,T,6,true,"Tissue atlas Arabidopsis - ProteomicsDB",114,32188942,"MaxQuant score",146.3000000,0.9224730,,,,4.5503298906624E-7,
ETSATDLKRPR,ph,S,7,true,"Tissue atlas Arabidopsis - ProteomicsDB",114,32188942,"MaxQuant score",86.2620000,0.9710780,,,,0.0002151429944206,
ETSATDLK,ph,S,7,true,"atm and atr DNA damage response",88,25561503,"MASCOT Score",24.0000000,0.9950000,,,,,-0.5200000
VEKVLFQGK,ub,K,66,true,"upl3 mutant / wildtype",168,35926874,"MaxQuant score",66.2990000,1.0000000,1.1576905,0.3927200,NO,0.0044583799317479,-0.4711000
GVIQLTER,nt,G,94,false,"Arg/N-end rule seed, prt6 vs. Wt",99,29168982,"MASCOT Score",28.3500000,,-0.2594357,0.3382258,NO,0.21799999475479,-0.4396650
HASIEQIDMCEIDK,ph,S,143,true,"Tissue atlas Arabidopsis - ProteomicsDB",114,32188942,"MaxQuant score",166.5200000,1.0000000,,,,1.5880400276437E-15,
HASIEQIDMCEIDK,sno,C,150,true,"Site-specific nitrosomeproteomic id - gsnor1-3",90a,25699590,XCorr,2.3765728,,,,,0.00028209999436513,-5.3856505
HASIEQIDMCEIDK,sno,C,150,true,"Site-specific nitrosomeproteomic id - gsnor1-3",90b,25699590,XCorr,3.5400000,,,,,3.2150001061382E-5,-6.7000000
HASIEQIDMCEIDK,so,C,150,true,"Arabidopsis S-sulfenylation chemoproteomics",108,31578252,"pFind PSM Score",0.0130894,,,,,,-2.2752699
ELFEKPFFQSVAR,ub,K,215,true,"upl3 mutant / wildtype",168,35926874,"MaxQuant score",85.5540000,1.0000000,-0.8943219,,,2.0133100406383E-5,1.7917000
IIEDIVSNCR,nt,I,244,false,"Arg/N-end rule seed, prt6 vs. Wt",99,29168982,"MASCOT Score",28.4900000,,-0.9476233,0.0240995,NO,0.020509999245405,-2.3966302
HPLNPIDESSSKSNGPLK,ac,K,302,true,"Quantitative Acetylproteomics",101,29440448,,,,,,,,
HPLNPIDESSSKSNGPLK,ub,K,302,true,"upl3 mutant / wildtype",168,35926874,"MaxQuant score",51.4950000,1.0000000,,,,0.00085451500490308,-0.1778200
