Peptide,PTM,ModifiedAA,ModifiedPosition,PeptideUniqueToGene,ExperimentDesc,ExpID,PubmedID,ScoreType,IdentScore,LocProb,Log2FChange,PQ-val,QuantSig,PEP,MassErrorPPM
STESYEDAIKRLGE,nt,S,2,true,"N-terminal ChaFRADIC",92,26010716,"MASCOT Score",21.0700000,,,,,0.003878999967128,
STESYEDAIKR,nt,S,2,true,"N-terminal ChaFRADIC",92,26010716,"MASCOT Score",21.2400000,,,,,0.00034009999944828,
STESYEDAIKRLGE,nta,S,2,true,"N-terminal ChaFRADIC",92,26010716,"MASCOT Score",21.0700000,,,,,0.003878999967128,
STESYEDAIKR,nta,S,2,true,"N-terminal ChaFRADIC",92,26010716,"MASCOT Score",21.2400000,,,,,0.00034009999944828,
STESYEDAIKR,ph,S,2,true,"Tissue atlas Arabidopsis - ProteomicsDB",114,32188942,"MaxQuant score",202.1600000,0.9064040,,,,2.091279923287E-24,
STESYEDAIKR,ph,T,3,true,"Tissue atlas Arabidopsis - ProteomicsDB",114,32188942,"MaxQuant score",134.1300000,0.9300200,,,,2.1960199774185E-6,
KSDLGNVAAAK,ph,S,21,true,"Tissue atlas Arabidopsis - ProteomicsDB",114,32188942,"MaxQuant score",66.0590000,1.0000000,,,,0.0042130500078201,
LTDELEELDSNK,ph,T,35,true,"SIRK1 phosphorylation",86a,23820729,"MaxQuant Score",59.8650000,0.9980000,,,,1.2239999771118,6.4400000
TNNYEKNPTLYNSLAK,ph,T,69,true,"Tissue atlas Arabidopsis - ProteomicsDB",114,32188942,"MaxQuant score",61.3610000,0.9458070,,,,0.00038796599255875,
