Peptide,PTM,ModifiedAA,ModifiedPosition,PeptideUniqueToGene,ExperimentDesc,ExpID,PubmedID,ScoreType,IdentScore,LocProb,Log2FChange,PQ-val,QuantSig,PEP,MassErrorPPM
ALKALDYDTLNENVKKCQYAVR,nt,A,2,true,"N-terminal ChaFRADIC",92,26010716,"MASCOT Score",22.0100000,,,,,1.419000000169E-6,
ALKALDYDTLNENVKKCQYAVR,nt,A,2,true,"Stromal N-terminome",96,26371235,"MASCOT Score",63.5400000,,,,,,
ALKALDYDTLNENVKKCQY,nt,A,2,true,"Stromal N-terminome",96,26371235,"MASCOT Score",76.5800000,,,,,,
ALKALDYDTLNENVKKCQ,nt,A,2,true,"Stromal N-terminome",96,26371235,"MASCOT Score",71.0600000,,,,,,
ALKALDYDTLNEN,nt,A,2,true,"Stromal N-terminome",96,26371235,"MASCOT Score",31.9400000,,,,,,
ALKALDYDTLNEN,nt,A,2,true,"Arg/N-end rule seed, prt6 vs. Wt",99,29168982,"MASCOT Score",61.2700000,,,,,0.0098789995536208,-6.3814453
ALKALDYDTLNE,nt,A,2,true,"N-terminal ChaFRADIC",92,26010716,"MASCOT Score",49.7400000,,,,,0.0017049999441952,
ALKALDYDTLNE,nt,A,2,true,"Stromal N-terminome",96,26371235,"MASCOT Score",65.0000000,,,,,,
ALKALDYDTLNE,nt,A,2,true,"HUNTER N-terminome: legumain, GluC and trypsin",119,31951383,"MaxQuant score",123.8800000,,,,,,
ALKALDYDTL,nt,A,2,true,"N-term acetylation drought responses",5,26184543,,,,,,,,
ALKALDYDTLNENVKKCQYAVR,nta,A,2,true,"N-terminal ChaFRADIC",92,26010716,"MASCOT Score",22.0100000,,,,,1.419000000169E-6,
ALKALDYDTLNENVKKCQYAVR,nta,A,2,true,"Stromal N-terminome",96,26371235,"MASCOT Score",63.5400000,,,,,,
ALKALDYDTLNENVKKCQYAVR,nta,A,2,true,"HUNTER N-terminome: legumain, GluC and trypsin",119,31951383,"MaxQuant score",140.6400000,,,,,,
ALKALDYDTLNENVKKCQY,nta,A,2,true,"Arg/N-end rule pathway Roots",80,25728785,"MASCOT Score",52.6700000,,,,,9.7579999192021E-8,
ALKALDYDTLNENVKKCQY,nta,A,2,true,"Stromal N-terminome",96,26371235,"MASCOT Score",76.5800000,,,,,,
ALKALDYDTLNENVKKCQ,nta,A,2,true,"Stromal N-terminome",96,26371235,"MASCOT Score",71.0600000,,,,,,
ALKALDYDTLNENVKK,nta,A,2,true,"Arabidopsis translation initiation landscape - NTA",167a,35069635,,,,,,,,
ALKALDYDTLNEN,nta,A,2,true,"Stromal N-terminome",96,26371235,"MASCOT Score",31.9400000,,,,,,
ALKALDYDTLNEN,nta,A,2,true,"Arg/N-end rule seed, prt6 vs. Wt",99,29168982,"MASCOT Score",61.2700000,,-1.1356486,0.0674719,NO,0.0098789995536208,-6.3814453
ALKALDYDTLNEN,nta,A,2,true,"HUNTER N-terminome: legumain, GluC and trypsin",119,31951383,"MaxQuant score",40.9940000,,,,,,
ALKALDYDTLNE,nta,A,2,true,"N-terminal ChaFRADIC",92,26010716,"MASCOT Score",49.7400000,,,,,0.0017049999441952,
ALKALDYDTLNE,nta,A,2,true,"Stromal N-terminome",96,26371235,"MASCOT Score",65.0000000,,,,,,
ALKALDYDTL,nta,A,2,true,"N-term acetylation drought responses",5,26184543,,,,,,,,
ALDYDTLNENVKKCQYAVR,nt,A,5,true,"HUNTER N-terminome: legumain, GluC and trypsin",119,31951383,"MaxQuant score",68.4100000,,,,,,
ALDYDTLNE,nt,A,5,true,"N-terminal ChaFRADIC",92,26010716,"MASCOT Score",43.1600000,,,,,0.014770000241697,
ALDYDTLNE,nt,A,5,true,"HUNTER N-terminome: legumain, GluC and trypsin",119,31951383,"MaxQuant score",98.9970000,,,,,,
ALDYDTLN,nt,A,5,true,"HUNTER N-terminome: legumain, GluC and trypsin",119,31951383,"MaxQuant score",100.4500000,,,,,,
LDYDTLNE,nt,L,6,true,"N-terminal ChaFRADIC",92,26010716,"MASCOT Score",46.2900000,,,,,0.03677000105381,
ALDYDTLNENVKK,ac,K,16,true,"Quantitative Acetylproteomics",101,29440448,,,,,,,,
CQYAVR,sno,C,18,false,"hot5-4 / wildtype, FAT-switch S-nitrosoproteome",169,37277371,,,,,,,,
ASELQKEGK,ac,K,35,false,"Histone deacetylases - apicidin vs control",98a,29061669,"MaxQuant Score",140.8000000,1.0000000,0.0270000,0.8871560,NO,6.9000001531094E-5,
IIFTNVGNPHALGQKPLTFPR,ac,K,54,false,"Histone deacetylases- hda14 vs WT (low light)",98c,29061669,"MaxQuant Score",91.7300000,1.0000000,0.2720000,0.9885531,NO,3.6999999792897E-6,
IIFTNVGNPHALGQKPLTFPR,ub,K,54,false,"upl3 mutant / wildtype",168,35926874,"MaxQuant score",115.5400000,1.0000000,1.1050075,,,9.9162204055675E-13,-0.3173200
QVVALCQAPFLLDDPNVGMLFPADAIAR,nt,Q,61,true,"HUNTER N-terminome: legumain, GluC and trypsin",119,31951383,"MaxQuant score",73.3410000,,,,,,
AKHYLSLTSGGLGAYSDSR,ac,K,90,false,"Quantitative Acetylproteomics",101,29440448,,,,,,,,
KEVAEFIQR,ub,K,114,true,"Arabidopsis ubiquitination COFRADIC",40,26744219,"MaxQuant Score",59.0670000,1.0000000,,,,0.019999999552965,0.2820000
QILNCVIR,nt,Q,145,false,"HUNTER N-terminome: legumain, GluC and trypsin",119,31951383,"MaxQuant score",93.2620000,,,,,,
GVMQILNCVIR,ox,C,149,false,"OxiTRAQ SA and flg22 responses - SA vs mock",91a,25720653,"MASCOT Score",47.9800000,,1.7697717,0.0040000,YES,,
GVMQILNCVIR,ox,C,149,false,"OxiTRAQ SA and flg22 responses - flg22 vs mock",91b,25720653,"MASCOT Score",47.9800000,,1.1110313,0.3090000,NO,,
GVMQILNCVIR,so,C,149,false,"S-sulfenylation site detection using YAP1C",110,32714340,,,,,,,,
AMVIINPGNPTGQCLSEANIR,sno,C,226,false,"Site-specific nitrosomeproteomic id - gsnor1-3",90a,25699590,XCorr,4.0901446,,,,,2.1250000870054E-8,-3.8674267
AMVIINPGNPTGQCLSEANIR,sno,C,226,false,"Site-specific nitrosomeproteomic id - gsnor1-3",90b,25699590,XCorr,3.9700000,,,,,0.028319999575615,-4.7100000
AMVIINPGNPTGQCLSEANIR,so,C,226,false,"S-sulfenylation site detection using YAP1C",110,32714340,,,,,,,,
EILKFCYNEK,ac,K,237,true,"Histone deacetylases substrates - hda14 vs WT",98e,29061669,"MaxQuant Score",61.3000000,1.0000000,-0.1540000,0.9120108,NO,0.0040000001899898,
FCYNEK,sno,C,239,true,"hot5-4 / wildtype, FAT-switch S-nitrosoproteome",169,37277371,,,,,,,,
FCYNEK,so,C,239,true,"S-sulfenylation site detection using YAP1C",110,32714340,,,,,,,,
KVLMEMGSPFSK,ac,K,268,true,"Quantitative Acetylproteomics",101,29440448,,,,,,,,
KVLMEMGSPFSK,ub,K,268,true,"upl3 mutant / wildtype",168,35926874,"MaxQuant score",76.3570000,1.0000000,0.2666366,,,0.00062662898562849,-0.6202600
KVLMEMGSPFSK,ph,S,275,true,"atm and atr DNA damage response",88,25561503,"MASCOT Score",34.0000000,1.0000000,,,,,-1.7400000
VLMEMGSPFSK,ph,S,275,true,"atm and atr DNA damage response",88,25561503,"MASCOT Score",41.0000000,1.0000000,,,,,0.6000000
VLMEMGSPFSK,ph,S,275,true,"TOR Kinase and ABA Receptor",100,29290610,XCorr,2.8950200,0.9929000,,,,0.01444000005722,
VLMEMGSPFSK,ph,S,275,true,"Tissue atlas Arabidopsis - ProteomicsDB",114,32188942,"MaxQuant score",102.9000000,0.9960430,,,,1.5156199879129E-5,
GYWGECGQR,sno,C,297,false,"hot5-4 / wildtype, FAT-switch S-nitrosoproteome",169,37277371,,,,,,,,
LMTDGFNSCK,acy,C,377,true,"Arabidopsis S-acylation atlas - Leaf",163c,35681017,,,,,,,,
LMTDGFNSCK,sno,C,377,true,"Site-specific nitrosomeproteomic id - gsnor1-3",90a,25699590,XCorr,2.7990170,,,,,0.00032809999538586,-5.8236758
LMTDGFNSCK,sno,C,377,true,"Site-specific nitrosomeproteomic id - gsnor1-3",90b,25699590,XCorr,2.0996125,,,,,0.10180000215769,-6.6028480
LMTDGFNSCK,sno,C,377,true,"hot5-4 / wildtype, FAT-switch S-nitrosoproteome",169,37277371,,,,-0.4245919,0.0008775,NO,,
NVVCNFTEGAMYSFPQIR,sno,C,382,true,"Cold stress nitrosylation - 4°C vs 22°C",65,24388526,,,,,,,,
LPTGALQAAK,ph,T,399,true,"atm and atr DNA damage response",88,25561503,"MASCOT Score",46.0000000,1.0000000,,,,,-1.0500000
LPTGALQAAK,ph,T,399,true,"Tissue atlas Arabidopsis - ProteomicsDB",114,32188942,"MaxQuant score",90.9750000,1.0000000,,,,0.003174819983542,
LPTGALQAAKQAGK,ac,K,406,true,"Histone deacetylases substrates - TSA vs control",98b,29061669,"MaxQuant Score",59.2000000,1.0000000,0.7140000,0.9794900,NO,0.00091000000247732,
VPDVFYCLK,acy,C,417,false,"Arabidopsis S-acylation atlas - Meristem",163a,35681017,,,,,,,,
VPDVFYCLK,sno,C,417,false,"Cold stress nitrosylation - 4°C vs 22°C",65,24388526,,,,2.0703893,,NO,,
VPDVFYCLK,so,C,417,false,"S-sulfenylation site detection using YAP1C",110,32714340,,,,,,,,
