Peptide,PTM,ModifiedAA,ModifiedPosition,PeptideUniqueToGene,ExperimentDesc,ExpID,PubmedID,ScoreType,IdentScore,LocProb,Log2FChange,PQ-val,QuantSig,PEP,MassErrorPPM
IETGIFCR,ox,C,28,true,"OxiTRAQ Arabidopsis - 5 mM H2O2 versus control",47,24376095,,,,-0.0457205,0.2156497,NO,,
NQYNVTGICNR,ox,C,38,true,"OxiTRAQ Arabidopsis - 5 mM H2O2 versus control",47,24376095,,,,-0.1934908,0.0629265,NO,,
SSCPLANSR,ox,C,43,true,"OxiTRAQ Arabidopsis - 5 mM H2O2 versus control",47,24376095,,,,-0.0721417,0.3993395,NO,,
EVVVTTPR,ph,T,136,true,"Tissue atlas Arabidopsis - ProteomicsDB",114,32188942,"MaxQuant score",135.5500000,0.9797060,,,,0.0013171799946576,
AIETELMER,ph,T,163,true,"SIRK1 phosphorylation",86a,23820729,"MaxQuant Score",58.4250000,1.0000000,,,,0.92900002002716,12.3460000
AIETELMER,ph,T,163,true,"SIRK1 exp - 35S:SIRK1 vs WT",86c,23820729,,,,0.3210296,,NO,,
ESYLEGDDHDSDDEDDDDAEEQVVIHK,ph,S,247,true,"srk2dei ABA signaling phopshoproteomics",83,23572148,"MASCOT Score",89.0000000,,,,,,-0.0020000
ESYLEGDDHDSDDEDDDDAEEQVVIHK,ph,S,247,true,"SnRK2 protein kinase substrates",85,23776212,XCorr,5.9994574,0.9890000,,,,0.00032368800020777,
ESYLEGDDHDSDDEDDDDAEEQVVIHK,ph,S,247,true,"Brassinosteroid-Regulated Phosphorylation Dynamics",94,26187819,"MaxQuant Score",179.1900000,1.0000000,,,,6.8663624751916E-43,1.2250000
ESYLEGDDHDSDDEDDDDAEEQVVIHK,ph,S,247,true,"TOR Kinase and ABA Receptor",100,29290610,XCorr,6.9018888,1.0000000,,,,1.181000016004E-6,
ESYLEGDDHDSDDEDDDDAEEQVVIHK,ph,S,247,true,"Lateral root-induction - NAA vs control",106,23328941,"MASCOT Score",56.0000000,,,,,,
ESYLEGDDHDSDDEDDDDAEEQVVIHK,ph,S,247,true,"Col-0 callus - FC Col-0 vs. Col-0 Xray",111a,31410901,,56.1500000,,0.1017834,0.0000000,NO,,1.1021668
ESYLEGDDHDSDDEDDDDAEEQVVIHK,ph,S,247,true,"Col-0 X-ray callus - FC Col-0 vs. Col-0 Xray",111b,31410901,,56.1500000,,0.1017834,0.0000000,NO,,1.1021668
ESYLEGDDHDSDDEDDDDAEEQVVIHK,ph,S,247,true,"atm callus - FC atm vs. atm Xray",111c,31410901,,56.1500000,,0.7959328,0.0000000,NO,,1.1021668
ESYLEGDDHDSDDEDDDDAEEQVVIHK,ph,S,247,true,"atm-3 X-ray callus - FC atm vs. atm Xray",111d,31410901,,56.1500000,,0.7959328,0.0000000,NO,,1.1021668
