Peptide,PTM,ModifiedAA,ModifiedPosition,PeptideUniqueToGene,ExperimentDesc,ExpID,PubmedID,ScoreType,IdentScore,LocProb,Log2FChange,PQ-val,QuantSig,PEP,MassErrorPPM
VFKVSTVSTSPIDGQKPGTSGLR,nt,V,2,true,"Arg/N-end rule pathway Roots",80,25728785,"MASCOT Score",70.1400000,,,,,1.5869999758777E-9,
VFKVSTVSTSPIDGQKPGTSGLR,nt,V,2,true,"Stromal N-terminome",96,26371235,"MASCOT Score",63.5300000,,,,,,
VFKVSTVSTSPIDGQKPGTSGLR,nt,V,2,true,"HUNTER N-terminome: legumain, GluC and trypsin",119,31951383,"MaxQuant score",71.5400000,,,,,,
VFKVSTVSTSPIDGQKPGTSGLR,nt,V,2,true,"Arabidopsis translation initiation landscape - NT",167b,35069635,,,,,,,,
VFKVSTVSTSPID,nt,V,2,true,"HUNTER N-terminome: legumain, GluC and trypsin",119,31951383,"MaxQuant score",223.7800000,,,,,,
VFKVSTVSTS,nt,V,2,true,"N-term acetylation drought responses",5,26184543,,,,,,,,
VSTVSTSPIDGQKPGTSGLR,ph,T,10,true,"Tissue atlas Arabidopsis - ProteomicsDB",114,32188942,"MaxQuant score",122.1000000,0.9077880,,,,4.3707400357156E-16,
VSTVSTSPIDGQKPGTSGLR,ph,S,11,true,"Phospho cell culture sucrose/TOR",109,30833711,,,0.9672120,,,,,
VSTVSTSPIDGQKPGTSGLR,ph,S,11,true,"Tissue atlas Arabidopsis - ProteomicsDB",114,32188942,"MaxQuant score",120.1100000,0.9985620,,,,1.9368800649377E-16,
VSTVSTSPIDGQKPGTSGLR,ph,T,20,true,"Tissue atlas Arabidopsis - ProteomicsDB",114,32188942,"MaxQuant score",136.2400000,0.9535460,,,,1.0345999881701E-21,
ATFNALTAE,nt,A,42,true,"Arg/N-end rule seed, prt6 vs. Wt",99,29168982,"MASCOT Score",40.1000000,,0.0742214,0.5968926,NO,0.01465000025928,1.9027883
STPAVSAVIR,nt,S,95,false,"Arg/N-end rule seed, prt6 vs. Wt",99,29168982,"MASCOT Score",43.7100000,,-0.4172665,0.3068572,NO,0.070529997348785,-0.3389608
TPAVSAVIRE,nt,T,96,true,"Arg/N-end rule seed, prt6 vs. Wt",99,29168982,"MASCOT Score",21.4600000,,-0.0836339,0.7829229,NO,0.028359999880195,-2.3040655
ATGAFILTASHNPGGPTEDFGIK,ph,T,115,false,"PAMP-triggered phosphorylation",48,24601666,"MASCOT Score",41.2000000,,,,,,
ATGAFILTASHNPGGPTEDFGIK,ph,T,115,false,"srk2dei ABA signaling phopshoproteomics",83,23572148,"MASCOT Score",51.0000000,,,,,,-0.0007000
ATGAFILTASHNPGGPTEDFGIK,ph,T,121,false,"Ethylene-regulated phosphorylation ein2 mutant",30,19253305,"MASCOT Score",41.4815000,,,,,,-11.6935900
ATGAFILTASHNPGGPTEDFGIK,ph,T,121,false,"Phosphoproteome ethylene-regulated time response",46,24043427,"MASCOT Score",70.7200000,,,,,,-5.9653000
ATGAFILTASHNPGGPTEDFGIK,ph,T,121,false,"Tyrosine phosphorylation in Arabidopsis",59,18463617,"MASCOT Score",51.0000000,,,,,,-2.1427629
ATGAFILTASHNPGGPTEDFGIK,ph,T,121,false,"BSK8 and BSL2 regulating sucrose-ph synthase",66,24924143,"MaxQuant Score",92.4740000,,,,,,0.5708500
ATGAFILTASHNPGGPTEDFGIK,ph,T,121,false,"srk2dei ABA signaling phopshoproteomics",83,23572148,"MASCOT Score",83.0000000,,,,,,-0.0021000
ATGAFILTASHNPGGPTEDFGIK,ph,T,121,false,"SIRK1 phosphorylation",86a,23820729,"MaxQuant Score",151.0000000,0.8830000,,,,0.00091419997625053,5.9250000
ATGAFILTASHNPGGPTEDFGIK,ph,T,121,false,"SIRK1 exp - sirk1 mutant vs WT",86b,23820729,,,,0.2209785,,NO,,
ATGAFILTASHNPGGPTEDFGIK,ph,T,121,false,"SIRK1 exp - 35S:SIRK1 vs WT",86c,23820729,,,,0.2140441,,NO,,
ATGAFILTASHNPGGPTEDFGIK,ph,T,121,false,"Brassinosteroid-Regulated Phosphorylation Dynamics",94,26187819,"MaxQuant Score",160.9100000,0.9230000,,,,1.8769999971738E-16,2.0880000
ATGAFILTASHNPGGPTEDFGIK,ph,T,121,false,"Lateral root-induction - NAA vs control",106,23328941,"MASCOT Score",56.0000000,,0.1269225,0.6607202,NO,,
ATGAFILTASHNPGGPTEDFGIK,ph,T,121,false,"Tissue atlas Arabidopsis - ProteomicsDB",114,32188942,"MaxQuant score",148.3000000,0.8955890,,,,5.8079398857279E-34,
ATGAFILTASHNPGGPTEDFGIK,ph,S,123,false,"Arabidopsis root NAA phosphoproteome",18a,27643528,"MaxQuant Score",223.1500000,0.9990000,,,,0,-0.1010000
ATGAFILTASHNPGGPTEDFGIK,ph,S,123,false,"Phosphorylation Early Elicitor Signaling",23,17317660,,,,,,,,
ATGAFILTASHNPGGPTEDFGIK,ph,S,123,false,"Phosphorylation nuclei-enriched fractions",28,19245862,,,,,,,,
ATGAFILTASHNPGGPTEDFGIK,ph,S,123,false,"Phosphoproteome iron-deficient Arabidopsis roots",41,22438062,"MASCOT Score",86.9600000,,,,,,
ATGAFILTASHNPGGPTEDFGIK,ph,S,123,false,"Large-scale phosphorylation discovery",44,23111157,XCorr,3.6440000,,,,,,
ATGAFILTASHNPGGPTEDFGIK,ph,S,123,false,"Phosphoproteome ethylene-regulated time response",46,24043427,"MASCOT Score",103.9500000,,,,,,-7.4759000
ATGAFILTASHNPGGPTEDFGIK,ph,S,123,false,"PAMP-triggered phosphorylation",48,24601666,"MASCOT Score",72.2300000,,,,,,
ATGAFILTASHNPGGPTEDFGIK,ph,S,123,false,"Tyrosine phosphorylation in Arabidopsis",59,18463617,"MASCOT Score",66.0000000,,,,,,-2.2267928
ATGAFILTASHNPGGPTEDFGIK,ph,S,123,false,"srk2dei ABA signaling phopshoproteomics",83,23572148,"MASCOT Score",98.0000000,,,,,,-0.0025000
ATGAFILTASHNPGGPTEDFGIK,ph,S,123,false,"SnRK2 protein kinase substrates",85,23776212,XCorr,4.0099931,0.9990000,,,,3.1076798912011E-9,
ATGAFILTASHNPGGPTEDFGIK,ph,S,123,false,"Brassinosteroid-Regulated Phosphorylation Dynamics",94,26187819,"MaxQuant Score",193.8100000,1.0000000,,,,0,-4.1590000
ATGAFILTASHNPGGPTEDFGIK,ph,S,123,false,"Protein sumoylation and phosphorylation cross-talk",97,28419593,,,,,,,,
ATGAFILTASHNPGGPTEDFGIK,ph,S,123,false,"TOR Kinase and ABA Receptor",100,29290610,XCorr,6.0261412,0.9969000,,,,3.5549998500528E-8,
ATGAFILTASHNPGGPTEDFGIK,ph,S,123,false,"Lateral root-induction - NAA vs control",106,23328941,"MASCOT Score",58.0000000,,,,,,
ATGAFILTASHNPGGPTEDFGIK,ph,S,123,false,"Phosphorylation tonoplast membrane fraction",107,18686298,"MASCOT Score",55.0000000,,,,,,
ATGAFILTASHNPGGPTEDFGIK,ph,S,123,false,"Phospho cell culture sucrose/TOR",109,30833711,,,0.9988560,,,,,
ATGAFILTASHNPGGPTEDFGIK,ph,S,123,false,"Col-0 callus - FC Col-0 vs. Col-0 Xray",111a,31410901,,69.9200000,,0.3822905,0.0000000,NO,,1.0035229
ATGAFILTASHNPGGPTEDFGIK,ph,S,123,false,"Col-0 X-ray callus - FC Col-0 vs. Col-0 Xray",111b,31410901,,69.9200000,,0.3822905,0.0000000,NO,,1.0035229
ATGAFILTASHNPGGPTEDFGIK,ph,S,123,false,"atm callus - FC atm vs. atm Xray",111c,31410901,,69.9200000,,1.4190331,0.0000000,NO,,1.0035229
ATGAFILTASHNPGGPTEDFGIK,ph,S,123,false,"atm-3 X-ray callus - FC atm vs. atm Xray",111d,31410901,,69.9200000,,1.4190331,0.0000000,NO,,1.0035229
ATGAFILTASHNPGGPTEDFGIK,ph,S,123,false,"Tissue atlas Arabidopsis - ProteomicsDB",114,32188942,"MaxQuant score",481.1100000,1.0000000,,,,0,
ATGAFILTASHNPGGPTEDFGIK,ph,S,123,false,"Touch-induced phosphorylation: 40s touch vs untouc",136,30291188,"MASCOT score",140.0100000,,0.1568804,0.5795138,NO,,-0.8239341
YNMENGGPAPESITDK,ph,S,148,false,"Tissue atlas Arabidopsis - ProteomicsDB",114,32188942,"MaxQuant score",102.0300000,0.9011980,,,,4.7243897824956E-6,
IYENTKTIK,ac,K,158,false,"Histone deacetylases - apicidin vs control",98a,29061669,"MaxQuant Score",91.7000000,1.0000000,-0.0500000,0.7638358,NO,0.0060000000521541,
FTFCYDALHGVAGAYAHR,ox,C,225,false,"OxiTRAQ SA and flg22 responses - SA vs mock",91a,25720653,"MASCOT Score",66.7500000,,0.8718436,0.0580000,NO,,
FTFCYDALHGVAGAYAHR,ox,C,225,false,"OxiTRAQ SA and flg22 responses - flg22 vs mock",91b,25720653,"MASCOT Score",66.7500000,,0.8639385,0.0350000,YES,,
IFVEELGAQESALLNCTPK,sno,C,255,true,"Site-specific nitrosomeproteomic id - gsnor1-3",90b,25699590,XCorr,3.7100000,,,,,7.340000252043E-7,-7.1000000
IFVEELGAQESALLNCTPK,so,C,255,true,"S-sulfenylation site detection using YAP1C",110,32714340,,,,,,,,
ELVARMGLGK,mox,M,280,true,"cat2 Methionine oxidation - 1h stress",62a,25693801,"MASCOT Score",72.0000000,,0.2211396,,NO,,
SDTGGEPPEFGAAADGDADR,ph,T,287,true,"Pollen phosphoproteome Arabidopsis",43,22631563,"MASCOT Score",111.4600000,,,,,,-2.1636300
SDTGGEPPEFGAAADGDADR,ph,T,287,true,"Tissue atlas Arabidopsis - ProteomicsDB",114,32188942,"MaxQuant score",219.0600000,0.8613400,,,,0,
SDTGGEPPEFGAAADGDADRNMILGKR,ac,K,310,true,"Quantitative Acetylproteomics",101,29440448,,,,,,,,
NMILGKR,ac,K,310,false,"Quantitative Acetylproteomics",101,29440448,,,,,,,,
GVARSMPTSAALDVVAK,mox,M,345,false,"cat2 Methionine oxidation - 1h stress",62a,25693801,"MASCOT Score",78.0000000,,0.4847482,,NO,,
GEESFGTGSDHIR,nt,G,385,false,"Arg/N-end rule seed, prt6 vs. Wt",99,29168982,"MASCOT Score",56.8200000,,-0.8454243,0.1371275,NO,0.0018980000168085,-0.1907399
YDYENVDAGKAK,ac,K,457,true,"Quantitative Acetylproteomics",101,29440448,,,,,,,,
SDVASVASADEFEYKDPVDGSISK,ph,S,488,true,"STN8 phosphoproteome",38,21768351,"MASCOT Score",49.4400000,,,,,,1.6246500
SDVASVASADEFEYKDPVDGSISK,ph,S,488,true,"PAMP-triggered phosphorylation",48,24601666,"MASCOT Score",24.2700000,,,,,,
SDVASVASADEFEYKDPVDGSISK,ph,S,488,true,"srk2dei ABA signaling phopshoproteomics",83,23572148,"MASCOT Score",77.0000000,,,,,,-0.0050000
SDVASVASADEFEYKDPVDGSISK,ph,S,488,true,"SnRK2 protein kinase substrates",85,23776212,XCorr,3.2561550,0.9100000,,,,0.0020926299039274,
SDVASVASADEFEYKDPVDGSISK,ph,S,488,true,"Phospho cell culture sucrose/TOR",109,30833711,,,0.9996120,,,,,
SDVASVASADEFEYKDPVDGSISK,ph,S,488,true,"Tissue atlas Arabidopsis - ProteomicsDB",114,32188942,"MaxQuant score",374.6800000,0.9999990,,,,0,
SDVASVASADEFEYK,ph,S,488,true,"TOR Kinase and ABA Receptor",100,29290610,XCorr,4.1637111,0.9841000,,,,0.00020080000103917,
SDVASVASADEFEYKDPVDGSISK,ub,K,498,true,"upl3 mutant / wildtype",168,35926874,"MaxQuant score",77.5760000,1.0000000,-0.2986727,0.4352800,NO,7.3537698597193E-8,-1.0302000
LSGTGSEGATIR,ph,S,526,false,"atm and atr DNA damage response",88,25561503,"MASCOT Score",66.0000000,1.0000000,,,,,-0.4900000
LSGTGSEGATIR,ph,S,526,false,"Tissue atlas Arabidopsis - ProteomicsDB",114,32188942,"MaxQuant score",58.0980000,0.9909270,,,,0.015952300280333,
LYIEQYEKDASK,ub,K,544,false,"upl3 mutant / wildtype",168,35926874,"MaxQuant score",165.5800000,1.0000000,-0.4131152,0.3139400,NO,5.6595301362039E-11,0.6078700
