Peptide,PTM,ModifiedAA,ModifiedPosition,PeptideUniqueToGene,ExperimentDesc,ExpID,PubmedID,ScoreType,IdentScore,LocProb,Log2FChange,PQ-val,QuantSig,PEP,MassErrorPPM
AQATRQSSLQGELEVD,nta,A,2,true,"HUNTER N-terminome: legumain, GluC and trypsin",119,31951383,"MaxQuant score",127.3700000,,,,,,
AQATRQSSLQGELE,nta,A,2,true,"HUNTER N-terminome: legumain, GluC and trypsin",119,31951383,"MaxQuant score",182.1000000,,,,,,
ATPDIQGCALHEGEFGK,acy,C,48,true,"Arabidopsis S-acylation atlas - Leaf",163c,35681017,,,,,,,,
ATPDIQGCALHEGEFGK,ox,C,48,true,"SPEAR - 50 mM H2O2 / mock",138b,34619326,,,,-2.3167828,0.0195914,YES,,
ATPDIQGCALHEGEFGK,sno,C,48,true,"Site-specific nitrosomeproteomic id - gsnor1-3",90a,25699590,XCorr,3.4532862,,,,,3.1439999474969E-6,-5.4482463
ATPDIQGCALHEGEFGK,sno,C,48,true,"Site-specific nitrosomeproteomic id - gsnor1-3",90b,25699590,XCorr,3.4000000,,,,,5.3439998737304E-5,-6.6600000
VGSVIFWNYAIDGQPKVAR,ub,K,73,true,"upl3 mutant / wildtype",168,35926874,"MaxQuant score",69.2890000,1.0000000,0.6789733,,,3.7077399611007E-5,-1.0394000
IEAVDQEKNLLVLR,ub,K,86,true,"upl3 mutant / wildtype",168,35926874,"MaxQuant score",76.0730000,1.0000000,-0.1328943,0.8605800,NO,7.7756798418704E-5,0.6540300
IDEKVAPPEK,ub,K,134,true,"upl3 mutant / wildtype",168,35926874,"MaxQuant score",113.3800000,1.0000000,0.5983652,0.4941600,NO,0.00029571101185866,-0.2227600
