Peptide,PTM,ModifiedAA,ModifiedPosition,PeptideUniqueToGene,ExperimentDesc,ExpID,PubmedID,ScoreType,IdentScore,LocProb,Log2FChange,PQ-val,QuantSig,PEP,MassErrorPPM
IFSPDQCSGINR,sno,C,39,false,"hot5-4 / wildtype, FAT-switch S-nitrosoproteome",169,37277371,,,,,,,,
VESDVVSLDGHDFLETDAQIGDDGK,ph,S,179,true,"Tissue atlas Arabidopsis - ProteomicsDB",114,32188942,"MaxQuant score",85.8660000,0.9539700,,,,9.5199195748741E-13,
VESDVVSLDGHDFLETDAQIGDDGK,ph,S,183,true,"Phosphorylation Early Elicitor Signaling",23,17317660,,,,,,,,
SFYGGGGTNMTPR,ph,S,215,true,"atm and atr DNA damage response",88,25561503,"MASCOT Score",50.0000000,0.9950000,,,,,-0.3700000
SFYGGGGTNMTPR,ph,S,215,true,"Tissue atlas Arabidopsis - ProteomicsDB",114,32188942,"MaxQuant score",133.9000000,0.9999990,,,,7.1351597923501E-34,
SFYGGGGTNMTPR,ph,T,222,true,"Tissue atlas Arabidopsis - ProteomicsDB",114,32188942,"MaxQuant score",109.4100000,0.9178830,,,,7.1351597923501E-34,
SFYGGGGTNMTPRPSNLTGAEIYSLNTTPR,ph,T,225,true,"TOR Kinase and ABA Receptor",100,29290610,XCorr,3.7153592,0.9227000,,,,4.5150000005378E-6,
SFYGGGGTNMTPRPSNLTGAEIYSLNTTPR,ph,T,225,true,"Tissue atlas Arabidopsis - ProteomicsDB",114,32188942,"MaxQuant score",258.5400000,0.9998190,,,,0,
SFYGGGGTNMTPR,ph,T,225,true,"atm and atr DNA damage response",88,25561503,"MASCOT Score",52.0000000,1.0000000,,,,,-0.6800000
SFYGGGGTNMTPRPSNLTGAEIYSLNTTPR,ph,S,229,true,"Tissue atlas Arabidopsis - ProteomicsDB",114,32188942,"MaxQuant score",173.8100000,0.8913070,,,,0,
PSNLTGAEIYSLNTTPR,ph,S,238,true,"atm and atr DNA damage response",88,25561503,"MASCOT Score",64.0000000,0.9930000,,,,,-0.7400000
PSNLTGAEIYSLNTTPR,ph,S,238,true,"Tissue atlas Arabidopsis - ProteomicsDB",114,32188942,"MaxQuant score",331.6200000,0.9990940,,,,0,
PSNLTGAEIYSLNTTPR,ph,T,241,true,"Tissue atlas Arabidopsis - ProteomicsDB",114,32188942,"MaxQuant score",374.0300000,0.9149750,,,,0,
PSNLTGAEIYSLNTTPR,ph,T,242,true,"atm and atr DNA damage response",88,25561503,"MASCOT Score",64.0000000,0.9460000,,,,,-0.7400000
PSNLTGAEIYSLNTTPR,ph,T,242,true,"Tissue atlas Arabidopsis - ProteomicsDB",114,32188942,"MaxQuant score",325.1900000,0.9371360,,,,0,
GSNFNHSDFYSMMGFPGGR,ph,S,246,true,"Tissue atlas Arabidopsis - ProteomicsDB",114,32188942,"MaxQuant score",104.6600000,0.9994880,,,,3.9687300557034E-8,
LSNFGPADMYSVQSSR,ph,S,265,false,"atm and atr DNA damage response",88,25561503,"MASCOT Score",74.0000000,1.0000000,,,,,-0.4300000
LSNFGPADMYSVQSSR,ph,S,265,false,"Tissue atlas Arabidopsis - ProteomicsDB",114,32188942,"MaxQuant score",176.9400000,1.0000000,,,,3.5894200518509E-20,
LSNFGPADMYSVQSSR,ph,S,274,false,"Tissue atlas Arabidopsis - ProteomicsDB",114,32188942,"MaxQuant score",156.4900000,0.9922910,,,,1.5519699392291E-25,
LSNFGPADMYSVQSSR,ph,S,277,false,"Phosphorylation Early Elicitor Signaling",23,17317660,,,,,,,,
LSNFGPADMYSVQSSR,ph,S,277,false,"Phytohormone-responsive phosphoproteins",34,20374526,"MASCOT Score",55.0000000,,,,,,-8.0603900
LSNFGPADMYSVQSSR,ph,S,277,false,"Tissue atlas Arabidopsis - ProteomicsDB",114,32188942,"MaxQuant score",301.7000000,0.9893810,,,,0,
LSNFGPADMYSVQSSR,ph,S,278,false,"atm and atr DNA damage response",88,25561503,"MASCOT Score",66.0000000,0.9530000,,,,,-0.2300000
GPTPRPSNFEESCAMASSPR,ph,T,282,true,"Tissue atlas Arabidopsis - ProteomicsDB",114,32188942,"MaxQuant score",142.2300000,0.9999990,,,,3.2445300773411E-24,
GPTPRPSNFEESCAMASSPR,ph,S,286,true,"Tissue atlas Arabidopsis - ProteomicsDB",114,32188942,"MaxQuant score",103.6800000,0.9999300,,,,1.4254500357858E-12,
GPTPRPSNFEESCAMASSPR,ph,S,291,true,"Tissue atlas Arabidopsis - ProteomicsDB",114,32188942,"MaxQuant score",52.4510000,0.8750410,,,,0.00052199402125552,
PSNFEESCAMASSPR,ph,S,296,true,"Tissue atlas Arabidopsis - ProteomicsDB",114,32188942,"MaxQuant score",338.8000000,0.8451840,,,,0,
GPTPRPSNFEESCAMASSPR,ph,S,297,true,"TOR Kinase and ABA Receptor",100,29290610,XCorr,4.4637332,0.9983000,,,,6.1850000747654E-6,
PSNFEESCAMASSPR,ph,S,297,true,"atm and atr DNA damage response",88,25561503,"MASCOT Score",79.0000000,0.9970000,,,,,-0.1500000
PSNFEESCAMASSPR,ph,S,297,true,"Tissue atlas Arabidopsis - ProteomicsDB",114,32188942,"MaxQuant score",428.1100000,0.9942690,,,,0,
FGYYPGGAPGSYPAPNPEFSTGNK,ph,S,319,true,"Tissue atlas Arabidopsis - ProteomicsDB",114,32188942,"MaxQuant score",161.8000000,0.8626890,,,,0,
FGYYPGGAPGSYPAPNPEFSTGNKTGSK,ub,K,323,true,"Ubiquitination Membrane Proteins",120,33585938,,,,,,,,
ELHMFVWGSNGSPVSDR,ph,S,354,true,"Tissue atlas Arabidopsis - ProteomicsDB",114,32188942,"MaxQuant score",214.5400000,0.9593740,,,,0,
ELHMFVWGSNGSPVSDR,ph,S,357,true,"TOR Kinase and ABA Receptor",100,29290610,XCorr,5.1521826,1.0000000,,,,2.8930000439686E-7,
ELHMFVWGSNGSPVSDR,ph,S,357,true,"Tissue atlas Arabidopsis - ProteomicsDB",114,32188942,"MaxQuant score",254.7100000,0.9998700,,,,0,
AGLQVDNGANEQVGKSDQGGAK,ph,S,378,true,"Tissue atlas Arabidopsis - ProteomicsDB",114,32188942,"MaxQuant score",82.0860000,1.0000000,,,,1.2933800519477E-7,
VKEVPNGLHKLR,ub,K,426,true,"Ubiquitination Membrane Proteins",120,33585938,,,,,,,,
CNSTAELNPK,ox,C,429,true,"OxiTRAQ Arabidopsis - 5 mM H2O2 versus control",47,24376095,,,,0.4425406,0.0345227,YES,,
LRCNSTAELNPK,ph,S,431,true,"TOR Kinase and ABA Receptor",100,29290610,XCorr,3.7875233,0.9198000,,,,0.00020540000696201,
CNSTAELNPK,ph,S,431,true,"LAXIC - ABA stress",84a,23660473,XCorr,2.4000000,0.9850000,,,,0.23176899552345,
CNSTAELNPK,ph,S,431,true,"atm and atr DNA damage response",88,25561503,"MASCOT Score",53.0000000,0.9550000,,,,,-0.2700000
CNSTAELNPK,ph,S,431,true,"Tissue atlas Arabidopsis - ProteomicsDB",114,32188942,"MaxQuant score",228.9300000,0.9993720,,,,2.6009100361284E-36,
EAIETGETVPVK,ph,T,443,true,"Tissue atlas Arabidopsis - ProteomicsDB",114,32188942,"MaxQuant score",105.4100000,1.0000000,,,,0.00021690099674743,
EAIETGETVPVK,ph,T,446,true,"Tissue atlas Arabidopsis - ProteomicsDB",114,32188942,"MaxQuant score",105.4100000,1.0000000,,,,0.00021690099674743,
