Peptide,PTM,ModifiedAA,ModifiedPosition,PeptideUniqueToGene,ExperimentDesc,ExpID,PubmedID,ScoreType,IdentScore,LocProb,Log2FChange,PQ-val,QuantSig,PEP,MassErrorPPM
MNSLGGIR,nta,M,1,true,"Arabidopsis translation initiation landscape - NTA",167a,35069635,,,,,,,,
SMTTTESVR,nt,S,20,true,"N-terminal ChaFRADIC",92,26010716,"MASCOT Score",22.3000000,,,,,0.0010150000452995,
SMTTTESVR,nt,S,20,true,"Arg/N-end rule seed, prt6 vs. Wt",99,29168982,"MASCOT Score",53.5000000,,,,,0.18479999899864,-0.4392366
SMTTTESVR,nt,S,20,true,"Arabidopsis translation initiation landscape - NT",167b,35069635,,,,,,,,
SMTTTESVR,nta,S,20,true,"Arg/N-end rule seed, prt6 vs. Wt",99,29168982,"MASCOT Score",53.5000000,,,,,0.18479999899864,-0.4392366
SMTTTESVR,nta,S,20,true,"Arabidopsis translation initiation landscape - NTA",167a,35069635,,,,,,,,
TTTESVR,nt,T,22,true,"Arg/N-end rule seed, prt6 vs. Wt",99,29168982,"MASCOT Score",31.6000000,,-0.1165148,0.4201339,NO,0.17339999973774,-0.1228697
EFHELRSPR,ph,S,228,true,"Tissue atlas Arabidopsis - ProteomicsDB",114,32188942,"MaxQuant score",69.2610000,1.0000000,,,,0.0023580701090395,
NTHGTGCTLASCIAAELAK,so,C,246,true,"Arabidopsis S-sulfenylation chemoproteomics",108,31578252,"pFind PSM Score",0.0251950,,,,,,-1.6146964
GVAVVSALFDQDCVLTQAK,so,C,503,true,"S-sulfenylation site detection using YAP1C",110,32714340,,,,,,,,
