Peptide,PTM,ModifiedAA,ModifiedPosition,PeptideUniqueToGene,ExperimentDesc,ExpID,PubmedID,ScoreType,IdentScore,LocProb,Log2FChange,PQ-val,QuantSig,PEP,MassErrorPPM
MEGSSSAIARKTWELENNILPVEPT,nta,M,1,true,"Arabidopsis translation initiation landscape - NTA",167a,35069635,,,,,,,,
MEGSSSAIAR,nta,M,1,true,"N-term acetylation drought responses",5,26184543,,,,,,,,
MEGSSSAIAR,nta,M,1,true,"Characterization plant N-terminal acetylation",6,22223895,"MASCOT Score",89.6700000,,,,,,
MEGSSSAIAR,nta,M,1,true,"Arg/N-end rule pathway Roots",80,25728785,"MASCOT Score",66.1900000,,,,,8.8569999206811E-5,
MEGSSSAIAR,nta,M,1,true,"Arg/N-end rule seed, prt6 vs. Wt",99,29168982,"MASCOT Score",83.4800000,,,,,0.0045280000194907,0.2614919
MEGSSSAIAR,nta,M,1,true,"FtsH12 N-terminome: WT / FtsH12 knockdown miRNA",118,33216923,"MaxQuant score",87.9130000,,,,,0,
EGSSSAIARK,nt,E,2,true,"N-term acetylation drought responses",5,26184543,,,,,,,,
EGSSSAIARK,nta,E,2,true,"N-term acetylation drought responses",5,26184543,,,,,,,,
TWELENNILPVEPTDSASDSIFHYDDASQAK,ph,S,27,true,"TOR Kinase and ABA Receptor",100,29290610,XCorr,5.3003640,0.8451000,,,,1.7759999536793E-5,
TWELENNILPVEPTDSASDSIFHYDDASQAK,ph,Y,35,true,"srk2dei ABA signaling phopshoproteomics",83,23572148,"MASCOT Score",33.0000000,,,,,,-0.0045000
IEDFGVHCK,so,C,222,false,"Arabidopsis S-sulfenylation chemoproteomics",108,31578252,"pFind PSM Score",0.0030504,,1.0588000,,,,0.2663687
IEDFGVHCK,so,C,222,false,"S-sulfenylation site detection using YAP1C",110,32714340,,,,,,,,
LEQAESQLANSR,ph,S,287,true,"Phospho cell culture sucrose/TOR",109,30833711,,,0.9927990,,,,,
LEQAESQLANSR,ph,S,287,true,"Tissue atlas Arabidopsis - ProteomicsDB",114,32188942,"MaxQuant score",72.6620000,0.9566390,,,,0.0029531500767916,
YGGIAPAGHQR,nt,Y,289,true,"Arabidopsis translation initiation landscape - NT",167b,35069635,,,,,,,,
KEDEPQLAKITR,ub,K,309,true,"Arabidopsis ubiquitination COFRADIC",40,26744219,"MaxQuant Score",78.8140000,1.0000000,,,,0.00025959999766201,1.5840000
DILFNSAR,ph,S,337,true,"Tissue atlas Arabidopsis - ProteomicsDB",114,32188942,"MaxQuant score",125.9700000,1.0000000,,,,0.0029579699039459,
KSADDSSDPEPMITS,ub,K,343,true,"upl3 mutant / wildtype",168,35926874,"MaxQuant score",63.2900000,1.0000000,-0.0831412,0.0844810,NO,0.0039691301062703,0.5300800
KSADDSSDPEPMITS,ph,S,349,true,"Phospho cell culture sucrose/TOR",109,30833711,,,0.8685460,,,,,
KSADDSSDPEPMITS,ph,S,349,true,"Tissue atlas Arabidopsis - ProteomicsDB",114,32188942,"MaxQuant score",181.9700000,0.9047980,,,,3.1547099802422E-25,
SADDSSDPEPMITS,ph,S,349,true,"atm and atr DNA damage response",88,25561503,"MASCOT Score",26.0000000,0.9340000,,,,,-0.4300000
