Peptide,PTM,ModifiedAA,ModifiedPosition,PeptideUniqueToGene,ExperimentDesc,ExpID,PubmedID,ScoreType,IdentScore,LocProb,Log2FChange,PQ-val,QuantSig,PEP,MassErrorPPM
ASFDEAPPGNAKAGEKIFR,nt,A,2,true,"Stromal N-terminome",96,26371235,"MASCOT Score",71.5600000,,,,,,
ASFDEAPPGNAKAGEKIFR,nt,A,2,true,"FtsH12 N-terminome: WT / FtsH12 knockdown miRNA",118,33216923,"MaxQuant score",71.5920000,,-0.0089550,0.9693883,NO,0.00072064000414684,
ASFDEAPPGNAKAGE,nt,A,2,true,"N-terminal ChaFRADIC",92,26010716,"MASCOT Score",42.8000000,,,,,0.0036059999838471,
ASFDEAPPGNAKAGE,nt,A,2,true,"Stromal N-terminome",96,26371235,"MASCOT Score",46.0500000,,,,,,
ASFDEAPPGNAKAGE,nt,A,2,true,"Arg/N-end rule seed, prt6 vs. Wt",99,29168982,"MASCOT Score",42.1800000,,,,,8.3489998360164E-5,-1.2719732
ASFDEAPPGN,nt,A,2,false,"N-term acetylation drought responses",5,26184543,,,,,,,,
ASFDEAPPGNAKAGEKIFR,nta,A,2,true,"Arg/N-end rule pathway Roots",80,25728785,"MASCOT Score",24.8100000,,,,,0.057760000228882,
ASFDEAPPGNAKAGEKIFR,nta,A,2,true,"Stromal N-terminome",96,26371235,"MASCOT Score",71.5600000,,,,,,
ASFDEAPPGNAKAGEKIFR,nta,A,2,true,"HUNTER N-terminome: legumain, GluC and trypsin",119,31951383,"MaxQuant score",,,,,,,
ASFDEAPPGNAKAGEKIFR,nta,A,2,true,"Mitochondrial intermediate peptidases - icp55 / WT",131a,25732537,,94.1200000,,-0.0130523,,,,
ASFDEAPPGNAKAGEKIFR,nta,A,2,true,"Mitochondrial intermediate peptidases - oct1-1 / WT",131b,25732537,,93.9100000,,-0.2916822,,,,
ASFDEAPPGNAKAGEKIFR,nta,A,2,true,"Mitochondrial intermediate peptidases - oct1-2 / WT",131c,25732537,,93.6700000,,-0.4870682,,,,
ASFDEAPPGNAKAGEKIFR,nta,A,2,true,"Arabidopsis translation initiation landscape - NTA",167a,35069635,,,,,,,,
ASFDEAPPGNAKAGE,nta,A,2,true,"N-terminal ChaFRADIC",92,26010716,"MASCOT Score",42.8000000,,,,,0.0036059999838471,
ASFDEAPPGNAKAGE,nta,A,2,true,"Stromal N-terminome",96,26371235,"MASCOT Score",46.0500000,,,,,,
ASFDEAPPGNAKAGE,nta,A,2,true,"Arg/N-end rule seed, prt6 vs. Wt",99,29168982,"MASCOT Score",42.1800000,,-0.1732212,0.2713333,NO,8.3489998360164E-5,-1.2719732
ASFDEAPPGNAKAGE,nta,A,2,true,"HUNTER N-terminome: legumain, GluC and trypsin",119,31951383,"MaxQuant score",92.2470000,,,,,,
ASFDEAPPGNAK,nta,A,2,true,"Characterization plant N-terminal acetylation",6,22223895,"MASCOT Score",76.1400000,,,,,,
ASFDEAPPGN,nta,A,2,false,"N-term acetylation drought responses",5,26184543,,,,,,,,
EAPPGNAKAGE,nt,E,6,true,"Arg/N-end rule seed, prt6 vs. Wt",99,29168982,"MASCOT Score",44.9200000,,-0.0098929,0.9546590,NO,4.8450001486344E-5,-5.8720205
ASFDEAPPGNAKAGEKIFR,ub,K,13,true,"Arabidopsis ubiquitination COFRADIC",40,26744219,"MaxQuant Score",108.7100000,1.0000000,,,,1.8310000254267E-25,0.3990000
ASFDEAPPGNAKAGEKIFR,ub,K,17,true,"Arabidopsis ubiquitination COFRADIC",40,26744219,"MaxQuant Score",108.7100000,1.0000000,,,,1.8310000254267E-25,0.3990000
CAQCHTVEAGAGHK,ox,C,23,true,"OxiTRAQ Arabidopsis - 5 mM H2O2 versus control",47,24376095,,,,-0.0964988,0.6083132,NO,,
CAQCHTVEAGAGHK,ox,C,26,true,"OxiTRAQ Arabidopsis - 5 mM H2O2 versus control",47,24376095,,,,-0.0964988,0.6083132,NO,,
ALYDYLLNPKK,ac,K,81,true,"Lysine acetylation gel-based Arabidopsis",36,21311030,"MASCOT Score",61.0000000,,,,,,-0.2598000
ALYDYLLNPKK,ac,K,81,true,"Lysine acetylation gel-based Finkemeier et al",37,21311031,i-probability,1.0000000,,,,,,
ALYDYLLNPKK,me2,K,81,true,"Arabidopsis protein methylome",123,31809900,"MaxQuant Score",131.8200000,1.0000000,,,,4.8711099579933E-14,0.7285600
ALYDYLLNPKK,me3,K,81,true,"Arabidopsis protein methylome",123,31809900,"MaxQuant Score",128.0100000,0.9724790,,,,3.4144800428462E-27,0.1548500
MVFPGLKKPQDR,me3,K,95,false,"Arabidopsis protein methylome",123,31809900,"MaxQuant Score",88.5960000,0.8449250,,,,0.00034085899824277,0.1162700
ADLIAYLKESTAPK,ub,K,108,true,"Arabidopsis ubiquitination COFRADIC",40,26744219,"MaxQuant Score",91.0760000,1.0000000,,,,8.6449999798788E-6,1.7020000
ADLIAYLKESTAPK,ub,K,114,true,"Arabidopsis ubiquitination COFRADIC",40,26744219,"MaxQuant Score",91.0760000,1.0000000,,,,8.6449999798788E-6,1.7020000
