Peptide,PTM,ModifiedAA,ModifiedPosition,PeptideUniqueToGene,ExperimentDesc,ExpID,PubmedID,ScoreType,IdentScore,LocProb,Log2FChange,PQ-val,QuantSig,PEP,MassErrorPPM
AQEEIQKPT,nt,A,2,true,"Arg/N-end rule seed, prt6 vs. Wt",99,29168982,"MASCOT Score",28.8100000,,-0.4745943,0.0023153,NO,0.070649996399879,1.1647350
AQEEIQKPTASVPVVK,nta,A,2,true,"Characterization plant N-terminal acetylation",6,22223895,"MASCOT Score",53.7200000,,,,,,
AQEEIQKPT,nta,A,2,true,"Arg/N-end rule seed, prt6 vs. Wt",99,29168982,"MASCOT Score",28.8100000,,-0.3668303,0.0812684,NO,0.070649996399879,1.1647350
EETPAPVKEVEVPVTTEK,ub,K,25,true,"upl3 mutant / wildtype",168,35926874,"MaxQuant score",101.5000000,1.0000000,-0.3584540,0.4218400,NO,2.7199001384481E-10,0.7976100
EVEVPVTTEKAVAAPAPEATEEK,ub,K,35,true,"upl3 mutant / wildtype",168,35926874,"MaxQuant score",70.3450000,1.0000000,0.6544355,0.6558000,NO,2.3141499241319E-6,-0.9069500
VVSEVAVPETEVTAVKEEEVATGK,ph,S,51,true,"Tissue atlas Arabidopsis - ProteomicsDB",114,32188942,"MaxQuant score",119.8300000,1.0000000,,,,2.8971098552028E-26,
VVSEVAVPETEVTAVK,ph,S,51,true,"Large-scale phosphorylation discovery",44,23111157,XCorr,3.6370000,,,,,,
VVSEVAVPETEVTAVK,ph,S,51,true,"TOR Kinase and ABA Receptor",100,29290610,XCorr,3.4420948,1.0000000,,,,0.0051560001447797,
VVSEVAVPETEVTAVKEEEVATGK,ub,K,64,true,"upl3 mutant / wildtype",168,35926874,"MaxQuant score",95.2920000,1.0000000,-0.4839849,0.4434800,NO,4.9887199926602E-10,-0.7993800
EILQSESFKEEGYLASELQEAEKNALAELK,ph,S,77,true,"MAPK Arabidopsis substrates",45,23172892,"MaxQuant Score",76.2370000,,,,,,
EILQSESFKEEGYLASELQEAEK,ph,S,77,true,"Arabidopsis root NAA phosphoproteome",18a,27643528,"MaxQuant Score",116.1000000,0.8460000,,,,2.7089999624989E-18,-0.5470000
EILQSESFKEEGYLASELQEAEK,ph,S,77,true,"Phosphoproteome iron-deficient Arabidopsis roots",41,22438062,"MASCOT Score",75.5400000,,,,,,
EILQSESFKEEGYLASELQEAEK,ph,S,77,true,"Large-scale phosphorylation discovery",44,23111157,XCorr,4.2390000,,,,,,
EILQSESFKEEGYLASELQEAEKNALAELK,ph,S,79,true,"MAPK Arabidopsis substrates",45,23172892,"MaxQuant Score",106.5800000,,,,,,
EILQSESFKEEGYLASELQEAEK,ph,S,79,true,"Arabidopsis root NAA phosphoproteome",18a,27643528,"MaxQuant Score",133.8000000,0.8430000,,,,1.4960000114847E-25,1.6930000
EILQSESFKEEGYLASELQEAEK,ph,S,79,true,"PAMP-triggered phosphorylation",48,24601666,"MASCOT Score",43.7100000,,,,,,
EILQSESFKEEGYLASELQEAEK,ph,S,79,true,"srk2dei ABA signaling phopshoproteomics",83,23572148,"MASCOT Score",84.0000000,,,,,,0.0012000
EILQSESFKEEGYLASELQEAEK,ph,S,79,true,"LAXIC - ABA stress",84a,23660473,XCorr,6.4000000,0.7860000,,,,0.00021206500241533,
EILQSESFKEEGYLASELQEAEK,ph,S,79,true,"LAXIC - mannitol vs control",84b,23660473,XCorr,5.1100000,0.9550000,,,,5.5100000083408E-13,
EILQSESFKEEGYLASELQEAEK,ph,S,79,true,"SnRK2 protein kinase substrates",85,23776212,XCorr,5.4064174,0.9210000,,,,0.001806249958463,
EILQSESFKEEGYLASELQEAEK,ph,S,79,true,"TOR Kinase and ABA Receptor",100,29290610,XCorr,5.5005345,0.9021000,,,,9.1300002225125E-8,
EILQSESFKEEGYLASELQEAEK,ph,S,79,true,"Tissue atlas Arabidopsis - ProteomicsDB",114,32188942,"MaxQuant score",370.0800000,0.9999980,,,,0,
EILQSESFK,ph,S,79,true,"Chloroplast kinase substrates",60,19376835,"MASCOT Score",33.2300000,,,,,,0.1724860
EILQSESFK,ph,S,79,true,"srk2dei ABA signaling phopshoproteomics",83,23572148,"MASCOT Score",34.0000000,,,,,,0.0000000
EILQSESFK,ph,S,79,true,"TOR Kinase and ABA Receptor",100,29290610,XCorr,2.4127491,0.9912000,,,,0.031789999455214,
EILQSESFKEEGYLASELQEAEK,ph,Y,85,true,"Large-scale phosphorylation discovery",44,23111157,XCorr,6.6040000,,,,,,
EILQSESFKEEGYLASELQEAEK,ph,Y,85,true,"srk2dei ABA signaling phopshoproteomics",83,23572148,"MASCOT Score",54.0000000,,,,,,0.0011000
ALAELKELVR,nt,A,97,true,"Metacaspase9 substrates - Col-0 / mc9",51a,23964026,"MASCOT Score",51.0000000,,1.1850478,,NO,,-0.8535083
EFTAPPPPPAPVKEEK,ub,K,125,true,"upl3 mutant / wildtype",168,35926874,"MaxQuant score",82.5900000,1.0000000,-1.7417826,,,1.3043299986748E-5,0.3123400
EFTAPPPPPAPVKEEKVEEK,ub,K,128,true,"upl3 mutant / wildtype",168,35926874,"MaxQuant score",115.6300000,0.9140000,0.3010023,,,1.1499500353687E-12,1.0129000
TEEKSLEAETK,ph,S,150,true,"Large-scale phosphorylation discovery",44,23111157,XCorr,3.2860000,,,,,,
SLEAETKEEEK,ub,K,156,true,"upl3 mutant / wildtype",168,35926874,"MaxQuant score",186.8700000,1.0000000,-0.3997302,,,1.8569500592151E-13,-0.6103100
SLEAETKEEEKSAAPATVETK,ub,K,160,true,"upl3 mutant / wildtype",168,35926874,"MaxQuant score",133.2100000,0.9990000,1.0524159,0.0413430,YES,3.526730101177E-20,-0.9259300
KEEILAAPAPIVAETK,ub,K,171,true,"upl3 mutant / wildtype",168,35926874,"MaxQuant score",67.2510000,1.0000000,,,,0.000146278005559,-1.1690000
APAPIVAE,nt,A,177,true,"Arg/N-end rule seed, prt6 vs. Wt",99,29168982,"MASCOT Score",66.3600000,,-2.4953443,0.2303407,NO,0.0031530000269413,0.4866402
KEETPVAPAPVETKPAAPVVAETK,ub,K,187,true,"upl3 mutant / wildtype",168,35926874,"MaxQuant score",74.8760000,1.0000000,1.0257376,,,1.7849899336397E-7,0.0651920
KEETPVAPAPVETKPAAPVVAETK,ph,T,190,true,"Tissue atlas Arabidopsis - ProteomicsDB",114,32188942,"MaxQuant score",174.9300000,1.0000000,,,,0,
KEEILPAAPVTTETK,ph,T,221,true,"Large-scale phosphorylation discovery",44,23111157,XCorr,3.4460000,,,,,,
KEEILPAAPVTTETKVEEK,ub,K,225,true,"upl3 mutant / wildtype",168,35926874,"MaxQuant score",96.5500000,1.0000000,,,,1.5839999889522E-7,0.6228900
TTPAAPVTTE,nt,T,235,true,"Arg/N-end rule seed, prt6 vs. Wt",99,29168982,"MASCOT Score",43.5300000,,-0.0526042,0.8093256,NO,0.0061289998702705,-1.1153719
VVPVETTPAAPVTTETK,ph,T,236,true,"Tissue atlas Arabidopsis - ProteomicsDB",114,32188942,"MaxQuant score",117.1300000,0.9837180,,,,9.0407104025303E-9,
AAPVTTETKEEEK,ph,T,242,true,"Large-scale phosphorylation discovery",44,23111157,XCorr,3.4870000,,,,,,
VVPVETTPAAPVTTETKEEEK,ub,K,246,true,"upl3 mutant / wildtype",168,35926874,"MaxQuant score",62.7920000,1.0000000,0.9523336,,,4.4577500375453E-5,-1.1667000
AAPVTTETKEEEK,ph,T,255,true,"Large-scale phosphorylation discovery",44,23111157,XCorr,3.4870000,,,,,,
ATASTQVKR,ac,K,282,true,"Quantitative Acetylproteomics",101,29440448,,,,,,,,
FVSVTTSE,nt,F,292,true,"Arg/N-end rule seed, prt6 vs. Wt",99,29168982,"MASCOT Score",40.7400000,,-0.3362679,0.5559592,NO,0.036929998546839,0.1174820
DIFVSVTTSEKK,ph,T,297,true,"Tissue atlas Arabidopsis - ProteomicsDB",114,32188942,"MaxQuant score",150.2200000,0.7928130,,,,1.3464799621943E-6,
AFAADQEEE,nt,A,315,true,"N-terminal ChaFRADIC",92,26010716,"MASCOT Score",66.8800000,,,,,0.0027350001037121,
KENKIDDLVSEDLEGSEFEK,ph,S,403,true,"Tissue atlas Arabidopsis - ProteomicsDB",114,32188942,"MaxQuant score",281.9900000,1.0000000,,,,0,
IDDLVSEDLEGSEFEK,ph,S,403,true,"Arabidopsis root NAA phosphoproteome",18a,27643528,"MaxQuant Score",99.0920000,0.9990000,,,,7.5359996021263E-12,0.1630000
IDDLVSEDLEGSEFEK,ph,S,403,true,"STN8 phosphoproteome",38,21768351,"MASCOT Score",49.7200000,,,,,,-1.3366400
IDDLVSEDLEGSEFEK,ph,S,403,true,"LAXIC - ABA stress",84a,23660473,XCorr,4.9500000,1.0000000,,,,0.0021739099174738,
IDDLVSEDLEGSEFEK,ph,S,403,true,"LAXIC - mannitol vs control",84b,23660473,XCorr,4.0800000,1.0000000,,,,0.00016450800467283,
IDDLVSEDLEGSEFEK,ph,S,403,true,"SnRK2 protein kinase substrates",85,23776212,XCorr,3.9784656,1.0000000,,,,2.4836499523673E-10,
IDDLVSEDLEGSEFEK,ph,S,403,true,"TOR Kinase and ABA Receptor",100,29290610,XCorr,4.9379468,1.0000000,,,,5.9700000747398E-6,
IDDLVSEDLEGSEFEK,ph,S,403,true,"Lateral root-induction - NAA vs control",106,23328941,"MASCOT Score",23.0000000,,,,,,
IDDLVSEDLEGSEFEK,ph,S,409,true,"Tissue atlas Arabidopsis - ProteomicsDB",114,32188942,"MaxQuant score",112.6700000,0.9999990,,,,2.1725199417233E-7,
VIYSSYGE,nt,V,427,false,"Arg/N-end rule seed, prt6 vs. Wt",99,29168982,"MASCOT Score",29.8000000,,,,,0.058309998363256,-0.8281695
IQFQEKCVR,ub,K,460,true,"upl3 mutant / wildtype",168,35926874,"MaxQuant score",102.0700000,1.0000000,0.1230040,0.8761200,NO,0.0030660000629723,-1.8428000
SLDFSPEAKSSF,nt,S,464,true,"Arg/N-end rule seed, prt6 vs. Wt",99,29168982,"MASCOT Score",25.0400000,,-0.3665363,0.1165721,NO,0.12430000305176,-0.6702382
ALWQFIKR,ac,K,497,true,"Quantitative Acetylproteomics",101,29440448,,,,,,,,
TFGSIITSPR,ph,T,535,false,"Tissue atlas Arabidopsis - ProteomicsDB",114,32188942,"MaxQuant score",154.2800000,0.8622250,,,,1.8002699562203E-6,
TFGSIITSPR,ph,S,536,false,"srk2dei ABA signaling phopshoproteomics",83,23572148,"MASCOT Score",40.0000000,,,,,,0.0009000
TFGSIITSPR,ph,S,536,false,"atm and atr DNA damage response",88,25561503,"MASCOT Score",30.0000000,0.9950000,,,,,-0.0400000
TFGSIITSPR,ph,S,536,false,"TOR Kinase and ABA Receptor",100,29290610,XCorr,3.4680328,0.9965000,,,,4.1759998566704E-5,
TFGSIITSPR,ph,S,536,false,"Tissue atlas Arabidopsis - ProteomicsDB",114,32188942,"MaxQuant score",182.2300000,0.9384230,,,,9.6795904624969E-10,
MVLSGPSKSAETIFK,ac,K,550,true,"Quantitative Acetylproteomics",101,29440448,,,,,,,,
YGGLSKDSPFTVEDGVTEAVVK,ph,Y,568,true,"Sucrose-induced phosphorylation",24,17586839,,,,,,,,
YGGLSKDSPFTVEDGVTEAVVK,ub,K,573,true,"upl3 mutant / wildtype",168,35926874,"MaxQuant score",80.3140000,1.0000000,,,,2.2048000118957E-6,0.3608700
VLGADVSYGAQFEPSNEASYTVIVSKNR,ub,K,637,true,"upl3 mutant / wildtype",168,35926874,"MaxQuant score",74.2870000,1.0000000,,,,1.9045899579684E-10,-0.3292800
