Peptide,PTM,ModifiedAA,ModifiedPosition,PeptideUniqueToGene,ExperimentDesc,ExpID,PubmedID,ScoreType,IdentScore,LocProb,Log2FChange,PQ-val,QuantSig,PEP,MassErrorPPM
ADAVNAQTPSLSEQYHLEKE,nt,A,2,true,"Arg/N-end rule seed, prt6 vs. Wt",99,29168982,"MASCOT Score",65.2000000,,,,,0.0015450000064448,-1.8038878
ADAVNAQTPSLSEQYHL,nt,A,2,true,"Arg/N-end rule seed, prt6 vs. Wt",99,29168982,"MASCOT Score",45.8700000,,,,,0.011389999650419,-1.3444202
ADAVNAQTPSLSEQYH,nt,A,2,true,"Arg/N-end rule seed, prt6 vs. Wt",99,29168982,"MASCOT Score",33.9000000,,,,,0.098200000822544,0.0717049
ADAVNAQTPSLSEQY,nt,A,2,true,"Arg/N-end rule seed, prt6 vs. Wt",99,29168982,"MASCOT Score",23.3000000,,,,,0.030629999935627,-3.0125266
ADAVNAQTPSLSE,nt,A,2,true,"Arg/N-end rule seed, prt6 vs. Wt",99,29168982,"MASCOT Score",65.0800000,,-0.9817006,0.0790636,NO,1.1769999446187E-6,-1.6698316
ADAVNAQTPSLSEQYHLEKE,nta,A,2,true,"Arg/N-end rule seed, prt6 vs. Wt",99,29168982,"MASCOT Score",65.2000000,,-0.3782505,0.1790610,NO,0.0015450000064448,-1.8038878
ADAVNAQTPSLSEQYHLEK,nta,A,2,true,"Characterization plant N-terminal acetylation",6,22223895,"MASCOT Score",60.9700000,,,,,,
ADAVNAQTPSLSEQYHL,nta,A,2,true,"Arg/N-end rule seed, prt6 vs. Wt",99,29168982,"MASCOT Score",45.8700000,,,,,0.011389999650419,-1.3444202
ADAVNAQTPSLSEQYH,nta,A,2,true,"Arg/N-end rule seed, prt6 vs. Wt",99,29168982,"MASCOT Score",33.9000000,,,,,0.098200000822544,0.0717049
ADAVNAQTPSLSEQY,nta,A,2,true,"Arg/N-end rule pathway Roots",80,25728785,"MASCOT Score",56.7700000,,,,,0.00061899999855086,
ADAVNAQTPSLSEQY,nta,A,2,true,"Arg/N-end rule seed, prt6 vs. Wt",99,29168982,"MASCOT Score",23.3000000,,,,,0.030629999935627,-3.0125266
ADAVNAQTPSLSEQY,nta,A,2,true,"Arabidopsis translation initiation landscape - NTA",167a,35069635,,,,,,,,
ADAVNAQTPSLSE,nta,A,2,true,"Arg/N-end rule seed, prt6 vs. Wt",99,29168982,"MASCOT Score",34.8300000,,,,,0.00069539999822155,-1.4310367
ADAVNAQTPSLSE,nta,A,2,true,"HUNTER N-terminome: legumain, GluC and trypsin",119,31951383,"MaxQuant score",126.1900000,,,,,,
CVAAK,ox,C,147,false,"OxiTRAQ Arabidopsis - 5 mM H2O2 versus control",47,24376095,,,,-0.4596791,0.0492025,NO,,
GDDAPECDKFAK,ox,C,158,true,"OxiTRAQ Arabidopsis - 5 mM H2O2 versus control",47,24376095,,,,-0.4273152,0.0139508,NO,,
GDDAPECDKFAK,ac,K,160,true,"Histone deacetylases substrates - hda14 vs WT",98e,29061669,"MaxQuant Score",42.0000000,1.0000000,0.0820000,0.9120108,NO,0.0099999997764826,
SLCPSEWVDR,ox,C,169,true,"Bicarbonate Induced Redox Changes - 5 min",117a,28184230,,,,0.1763228,,YES,,
SLCPSEWVDR,sno,C,169,true,"hot5-4 / wildtype, FAT-switch S-nitrosoproteome",169,37277371,,,,0.3131008,0.0291453,NO,,
