Peptide,PTM,ModifiedAA,ModifiedPosition,PeptideUniqueToGene,ExperimentDesc,ExpID,PubmedID,ScoreType,IdentScore,LocProb,Log2FChange,PQ-val,QuantSig,PEP,MassErrorPPM
VQTDPKTPAASSASAATTTPATLTKPVGVN,nt,V,40,true,"HUNTER N-terminome: legumain, GluC and trypsin",119,31951383,"MaxQuant score",140.4600000,,,,,,
VQTDPKTPAASSASAATTTPATLTKPVGVN,nta,V,40,true,"HUNTER N-terminome: legumain, GluC and trypsin",119,31951383,"MaxQuant score",111.6800000,,,,,,
AFLLQGGDCAESFK,ox,C,139,false,"OxiTRAQ SA and flg22 responses - SA vs mock",91a,25720653,"MASCOT Score",22.0700000,,0.6229304,0.0050000,YES,,
AFLLQGGDCAESFK,ox,C,139,false,"OxiTRAQ SA and flg22 responses - flg22 vs mock",91b,25720653,"MASCOT Score",22.0700000,,-0.1520031,0.1650000,NO,,
LGQAAMGEAFLLQGGDCAESFK,sno,C,139,true,"hot5-4 / wildtype, FAT-switch S-nitrosoproteome",169,37277371,,,,0.3171431,0.0200552,NO,,
AFLLQGGDCAESFK,sno,C,139,false,"Site-specific nitrosomeproteomic id - gsnor1-3",90b,25699590,XCorr,3.4300000,,,,,0.016319999471307,-7.1100000
AFLLQGGDCAESFK,sno,C,139,false,"hot5-4 / wildtype, FAT-switch S-nitrosoproteome",169,37277371,,,,0.7365818,0.0013385,YES,,
MAGQFAKPR,ac,K,185,false,"Histone deacetylases - apicidin vs control",98a,29061669,"MaxQuant Score",107.6000000,1.0000000,0.0270000,0.8974288,NO,0.003000000026077,
SDSFEEKDGVK,ph,S,190,true,"Tissue atlas Arabidopsis - ProteomicsDB",114,32188942,"MaxQuant score",99.1610000,0.9994320,,,,0.00016863200289663,
AFATGGYAAMQR,nt,A,240,false,"Arabidopsis translation initiation landscape - NT",167b,35069635,,,,,,,,
QLDGAHVEFLR,nt,Q,341,false,"HUNTER N-terminome: legumain, GluC and trypsin",119,31951383,"MaxQuant score",147.7200000,,,,,,
VKLPHLIR,ac,K,400,false,"Quantitative Acetylproteomics",101,29440448,,,,,,,,
APCGLK,sno,C,431,false,"hot5-4 / wildtype, FAT-switch S-nitrosoproteome",169,37277371,,,,,,,,
YHTHCDPR,ox,C,494,false,"SPEAR - 50 mM H2O2 / mock",138b,34619326,,,,1.2748211,0.0184552,YES,,
YHTHCDPR,sno,C,494,false,"hot5-4 / wildtype, FAT-switch S-nitrosoproteome",169,37277371,,,,,,,,
YHTHCDPR,so,C,494,false,"S-sulfenylation site detection using YAP1C",110,32714340,,,,,,,,
