Peptide,PTM,ModifiedAA,ModifiedPosition,PeptideUniqueToGene,ExperimentDesc,ExpID,PubmedID,ScoreType,IdentScore,LocProb,Log2FChange,PQ-val,QuantSig,PEP,MassErrorPPM
GPSTTPDHSSPDESSR,ph,T,163,true,"Tissue atlas Arabidopsis - ProteomicsDB",114,32188942,"MaxQuant score",127.3200000,0.9602520,,,,9.882840146247E-8,
GPSTTPDHSSPDESSR,ph,S,167,true,"Large-scale phosphorylation discovery",44,23111157,XCorr,3.6070000,,,,,,
GPSTTPDHSSPDESSR,ph,S,167,true,"Tissue atlas Arabidopsis - ProteomicsDB",114,32188942,"MaxQuant score",108.4500000,0.9877280,,,,6.9449697548407E-8,
GPSTTPDHSSPDESSR,ph,S,168,true,"Large-scale phosphorylation discovery",44,23111157,XCorr,3.8110000,,,,,,
GPSTTPDHSSPDESSR,ph,S,168,true,"atm and atr DNA damage response",88,25561503,"MASCOT Score",51.0000000,1.0000000,,,,,-0.2000000
GPSTTPDHSSPDESSR,ph,S,168,true,"TOR Kinase and ABA Receptor",100,29290610,XCorr,4.3563418,0.9164000,,,,6.0209999901417E-6,
GPSTTPDHSSPDESSR,ph,S,168,true,"Tissue atlas Arabidopsis - ProteomicsDB",114,32188942,"MaxQuant score",127.3200000,0.9850770,,,,4.1816701212838E-8,
CRISPSDETLSHVDK,ph,S,178,true,"atm and atr DNA damage response",88,25561503,"MASCOT Score",44.0000000,1.0000000,,,,,0.5600000
CRISPSDETLSHVDK,ph,S,178,true,"Tissue atlas Arabidopsis - ProteomicsDB",114,32188942,"MaxQuant score",167.9700000,0.9934220,,,,2.7923899012068E-18,
TNIRGSFK,ph,S,195,true,"Tissue atlas Arabidopsis - ProteomicsDB",114,32188942,"MaxQuant score",104.1400000,1.0000000,,,,0.0045932098291814,
HDISSINEVDSLK,ph,S,240,true,"Tissue atlas Arabidopsis - ProteomicsDB",114,32188942,"MaxQuant score",165.8900000,0.9891940,,,,4.2579099968076E-12,
SVVSGDLSGLAQSPQK,ph,S,252,true,"srk2dei ABA signaling phopshoproteomics",83,23572148,"MASCOT Score",78.0000000,,,,,,-0.0009000
SVVSGDLSGLAQSPQK,ph,S,252,true,"LAXIC - mannitol vs control",84b,23660473,XCorr,5.2400000,0.9990000,,,,1.1600000474066E-12,
SVVSGDLSGLAQSPQK,ph,S,252,true,"SnRK2 protein kinase substrates",85,23776212,XCorr,2.4978631,0.7960000,,,,0.00013273200602271,
SVVSGDLSGLAQSPQK,ph,S,252,true,"atm and atr DNA damage response",88,25561503,"MASCOT Score",54.0000000,0.9430000,,,,,-0.2200000
SVVSGDLSGLAQSPQK,ph,S,252,true,"Tissue atlas Arabidopsis - ProteomicsDB",114,32188942,"MaxQuant score",244.1800000,1.0000000,,,,0,
SVVSGDLSGLAQSPQK,ph,S,256,true,"srk2dei ABA signaling phopshoproteomics",83,23572148,"MASCOT Score",56.0000000,,,,,,-0.0005000
SVVSGDLSGLAQSPQKEK,ph,S,261,true,"atm and atr DNA damage response",88,25561503,"MASCOT Score",35.0000000,1.0000000,,,,,-0.9900000
SVVSGDLSGLAQSPQKEK,ph,S,261,true,"Tissue atlas Arabidopsis - ProteomicsDB",114,32188942,"MaxQuant score",312.4600000,1.0000000,,,,0,
SVVSGDLSGLAQSPQKEK,ph,S,261,true,"Touch-induced phosphorylation: 40s touch vs untouc",136,30291188,"MASCOT score",93.9500000,,-0.1766782,0.1855248,NO,,7.1313641
SVVSGDLSGLAQSPQK,ph,S,261,true,"Tyrosine phosphorylation in Arabidopsis",59,18463617,"MASCOT Score",83.0000000,,,,,,-1.0291927
SVVSGDLSGLAQSPQK,ph,S,261,true,"Conserved plant phosphoproteome - Arabidopsis",61a,20466843,"MASCOT Score",33.0000000,1.0000000,,,,,
SVVSGDLSGLAQSPQK,ph,S,261,true,"srk2dei ABA signaling phopshoproteomics",83,23572148,"MASCOT Score",89.0000000,,,,,,-0.0006000
SVVSGDLSGLAQSPQK,ph,S,261,true,"LAXIC - ABA stress",84a,23660473,XCorr,3.5300000,1.0000000,,,,2.3200000498491E-7,
SVVSGDLSGLAQSPQK,ph,S,261,true,"LAXIC - mannitol vs control",84b,23660473,XCorr,5.2400000,1.0000000,,,,1.1600000474066E-12,
SVVSGDLSGLAQSPQK,ph,S,261,true,"atm and atr DNA damage response",88,25561503,"MASCOT Score",64.0000000,1.0000000,,,,,-0.9100000
SVVSGDLSGLAQSPQK,ph,S,261,true,"TOR Kinase and ABA Receptor",100,29290610,XCorr,5.7004356,1.0000000,,,,2.1949999595705E-9,
TQIEQPISHFSTVPSEK,ph,S,451,true,"Tissue atlas Arabidopsis - ProteomicsDB",114,32188942,"MaxQuant score",163.1100000,0.9999740,,,,9.5427903125417E-17,
TTCIAK,ox,C,805,true,"OxiTRAQ Arabidopsis - 5 mM H2O2 versus control",47,24376095,,,,0.5201056,0.0341194,YES,,
YMDENNQLLINLEVLKSELESSMAKSR,ph,S,1425,true,"Large-scale phosphorylation discovery",44,23111157,XCorr,4.3760000,,,,,,
APLTPQQESLR,ph,T,1574,true,"Large-scale phosphorylation discovery",44,23111157,XCorr,2.8400000,,,,,,
APLTPQQESLR,ph,T,1574,true,"Tissue atlas Arabidopsis - ProteomicsDB",114,32188942,"MaxQuant score",142.1200000,1.0000000,,,,3.4253500302839E-7,
AETLRSSMDHLNDELER,ph,S,1819,true,"atm and atr DNA damage response",88,25561503,"MASCOT Score",30.0000000,0.9940000,,,,,-0.6100000
SSMDHLNDELER,ph,S,1819,true,"atm and atr DNA damage response",88,25561503,"MASCOT Score",56.0000000,0.9680000,,,,,-0.2500000
SSMDHLNDELER,ph,S,1819,true,"Tissue atlas Arabidopsis - ProteomicsDB",114,32188942,"MaxQuant score",61.5320000,0.7955910,,,,0.0031556100584567,
SSSATLGEH,ph,S,1993,true,"Tissue atlas Arabidopsis - ProteomicsDB",114,32188942,"MaxQuant score",137.1400000,0.9999540,,,,9.6467796538491E-5,
