Peptide,PTM,ModifiedAA,ModifiedPosition,PeptideUniqueToGene,ExperimentDesc,ExpID,PubmedID,ScoreType,IdentScore,LocProb,Log2FChange,PQ-val,QuantSig,PEP,MassErrorPPM
DDSSPYCYFHPK,ph,S,9,true,"Tissue atlas Arabidopsis - ProteomicsDB",114,32188942,"MaxQuant score",110.6600000,0.8818990,,,,6.4259598730132E-5,
HSSSSPIISLPK,ph,S,48,true,"Tissue atlas Arabidopsis - ProteomicsDB",114,32188942,"MaxQuant score",212.9000000,0.9547530,,,,2.879759856107E-32,
HSSSSPIISLPK,ph,S,49,true,"Tissue atlas Arabidopsis - ProteomicsDB",114,32188942,"MaxQuant score",156.4600000,0.7891440,,,,1.0161500529904E-9,
HSSSSPIISLPK,ph,S,50,true,"atm and atr DNA damage response",88,25561503,"MASCOT Score",50.0000000,0.9490000,,,,,-0.7800000
HSSSSPIISLPK,ph,S,50,true,"TOR Kinase and ABA Receptor",100,29290610,XCorr,3.8601680,0.9077000,,,,0.0020399999339134,
HSSSSPIISLPK,ph,S,50,true,"Tissue atlas Arabidopsis - ProteomicsDB",114,32188942,"MaxQuant score",210.6100000,0.9644250,,,,2.7869400597544E-31,
KQQSPITSNTSIVEHNSAK,ph,S,132,true,"atm and atr DNA damage response",88,25561503,"MASCOT Score",84.0000000,1.0000000,,,,,0.5200000
KQQSPITSNTSIVEHNSAK,ph,S,132,true,"TOR Kinase and ABA Receptor",100,29290610,XCorr,4.6382160,0.8064000,,,,4.8329998207919E-6,
KQQSPITSNTSIVEHNSAK,ph,S,132,true,"Tissue atlas Arabidopsis - ProteomicsDB",114,32188942,"MaxQuant score",246.5900000,0.9999850,,,,0,
QQSPITSNTSIVEHNSAK,ph,S,132,true,"atm and atr DNA damage response",88,25561503,"MASCOT Score",89.0000000,1.0000000,,,,,-0.4800000
