Peptide,PTM,ModifiedAA,ModifiedPosition,PeptideUniqueToGene,ExperimentDesc,ExpID,PubmedID,ScoreType,IdentScore,LocProb,Log2FChange,PQ-val,QuantSig,PEP,MassErrorPPM
SSTISPARPR,ph,S,9,true,"Col-0 callus - FC Col-0 vs. Col-0 Xray",111a,31410901,,31.9900000,,1.1117246,0.0000000,NO,,-0.7240500
SSTISPARPR,ph,S,9,true,"Col-0 X-ray callus - FC Col-0 vs. Col-0 Xray",111b,31410901,,31.9900000,,1.1117246,0.0000000,NO,,-0.7240500
SSTISPARPR,ph,S,9,true,"atm callus - FC atm vs. atm Xray",111c,31410901,,31.9900000,,-3.4141832,0.0000000,NO,,-0.7240500
SSTISPARPR,ph,S,9,true,"atm-3 X-ray callus - FC atm vs. atm Xray",111d,31410901,,31.9900000,,-3.4141832,0.0000000,NO,,-0.7240500
SSTISPARPR,ph,T,11,true,"Tissue atlas Arabidopsis - ProteomicsDB",114,32188942,"MaxQuant score",103.4300000,0.9756240,,,,0.00015296299534384,
SSTISPARPR,ph,S,13,true,"STN8 phosphoproteome",38,21768351,"MASCOT Score",45.8700000,,,,,,-0.1391530
SSTISPARPR,ph,S,13,true,"Chloroplast kinase substrates",60,19376835,"MASCOT Score",46.2800000,,,,,,-0.1391530
SSTISPARPR,ph,S,13,true,"atm and atr DNA damage response",88,25561503,"MASCOT Score",32.0000000,0.9840000,,,,,1.1000000
SSTISPARPR,ph,S,13,true,"Col-0 callus - FC Col-0 vs. Col-0 Xray",111a,31410901,,26.4300000,,-1.9110967,0.0000000,NO,,-0.6135807
SSTISPARPR,ph,S,13,true,"Col-0 X-ray callus - FC Col-0 vs. Col-0 Xray",111b,31410901,,26.4300000,,-1.9110967,0.0000000,NO,,-0.6135807
SSTISPARPR,ph,S,13,true,"atm callus - FC atm vs. atm Xray",111c,31410901,,26.4300000,,0.6323625,0.0000000,NO,,-0.6135807
SSTISPARPR,ph,S,13,true,"atm-3 X-ray callus - FC atm vs. atm Xray",111d,31410901,,26.4300000,,0.6323625,0.0000000,NO,,-0.6135807
SSTISPARPR,ph,S,13,true,"Tissue atlas Arabidopsis - ProteomicsDB",114,32188942,"MaxQuant score",156.5800000,0.9999950,,,,1.5450699493158E-6,
RSPATIPMK,ph,S,20,true,"Tissue atlas Arabidopsis - ProteomicsDB",114,32188942,"MaxQuant score",69.8640000,0.9853510,,,,0.0058559197932482,
RPETPSSSHFSASPVTSSSPLLR,ph,T,31,true,"Tissue atlas Arabidopsis - ProteomicsDB",114,32188942,"MaxQuant score",261.2800000,0.9992510,,,,0,
RPETPSSSHFSASPVTSSSPLLR,ph,S,38,true,"Tissue atlas Arabidopsis - ProteomicsDB",114,32188942,"MaxQuant score",144.1800000,0.8380210,,,,7.1037502159541E-34,
RPETPSSSHFSASPVTSSSPLLR,ph,S,40,true,"atm and atr DNA damage response",88,25561503,"MASCOT Score",58.0000000,1.0000000,,,,,-0.5300000
RPETPSSSHFSASPVTSSSPLLR,ph,S,40,true,"TOR Kinase and ABA Receptor",100,29290610,XCorr,4.0369687,0.9542000,,,,1.0310000106983E-5,
RPETPSSSHFSASPVTSSSPLLR,ph,S,40,true,"Tissue atlas Arabidopsis - ProteomicsDB",114,32188942,"MaxQuant score",187.5500000,0.9985670,,,,0,
RPETPSSSHFSASPVTSSSPLLR,ph,S,46,true,"Tissue atlas Arabidopsis - ProteomicsDB",114,32188942,"MaxQuant score",121.7200000,0.9442380,,,,3.9504200282778E-22,
SSPSPSTSSAAASSTAVASTK,fuc,S,51,true,"SPINDLY O-fucosylation",162,36739885,,,,,,,1.2000000476837,
SSPSPSTSSAAASSTAVASTK,ph,S,52,true,"Tissue atlas Arabidopsis - ProteomicsDB",114,32188942,"MaxQuant score",154.7500000,0.7874420,,,,1.9335799487749E-29,
SSPSPSTSSAAASSTAVASTK,ph,S,54,true,"Tissue atlas Arabidopsis - ProteomicsDB",114,32188942,"MaxQuant score",102.9000000,0.8961810,,,,2.3011998973033E-9,
HVGSNNVNLFSSR,ph,S,259,true,"Tissue atlas Arabidopsis - ProteomicsDB",114,32188942,"MaxQuant score",77.5050000,0.9999490,,,,0.001249170047231,
VSLICTITPASSTSEETHNTLK,so,C,369,true,"Arabidopsis S-sulfenylation chemoproteomics",108,31578252,"pFind PSM Score",0.0096731,,1.2987000,,,,-2.2764833
SSLQAASVKPDHIWR,ph,S,475,true,"TOR Kinase and ABA Receptor",100,29290610,XCorr,2.0269561,0.8663000,,,,0.0067349998280406,
SSLQAASVKPDHIWR,ph,S,475,true,"Tissue atlas Arabidopsis - ProteomicsDB",114,32188942,"MaxQuant score",104.4500000,0.8631670,,,,3.2037200980994E-6,
DGNSSLDEMTK,ph,S,530,true,"Tissue atlas Arabidopsis - ProteomicsDB",114,32188942,"MaxQuant score",70.5400000,0.9837050,,,,0.0029934400226921,
KSDGVAGTLPTDGNQSQASGSPSSSSK,ph,S,574,true,"Phosphorylation Early Elicitor Signaling",23,17317660,,,,,,,,
SDGVAGTLPTDGNQSQASGSPSSSSK,ph,S,574,true,"Tissue atlas Arabidopsis - ProteomicsDB",114,32188942,"MaxQuant score",230.0300000,0.9290640,,,,0,
QSTQQIAGDESSGKNIHNR,ph,S,776,true,"Tissue atlas Arabidopsis - ProteomicsDB",114,32188942,"MaxQuant score",154.9500000,0.7837660,,,,1.5842000624134E-22,
NGEESEIYSGAGTPTSVMSLNR,ph,T,797,true,"Tissue atlas Arabidopsis - ProteomicsDB",114,32188942,"MaxQuant score",259.1600000,0.9947610,,,,0,
LCNENAKLSR,ph,S,889,true,"Tissue atlas Arabidopsis - ProteomicsDB",114,32188942,"MaxQuant score",59.1850000,1.0000000,,,,0.0038727698847651,
