Peptide,PTM,ModifiedAA,ModifiedPosition,PeptideUniqueToGene,ExperimentDesc,ExpID,PubmedID,ScoreType,IdentScore,LocProb,Log2FChange,PQ-val,QuantSig,PEP,MassErrorPPM
AGDGDTIIFTTLGRSHYE,nt,A,28,true,"Arabidopsis translation initiation landscape - NT",167b,35069635,,,,,,,,
AGDGDTIIFTTLGR,nt,A,28,true,"Tic56 chloroplast import - wild-type",89a,25588737,XCorr,4.0334420,,,,,,
AGDGDTIIFTTLGR,nt,A,28,true,"Tic56 chloroplast import - ppi2",89b,25588737,XCorr,4.4134493,,,,,,
AGDGDTIIFTTLGR,nt,A,28,true,"Tic56 chloroplast import - tic56-1",89c,25588737,XCorr,3.8060668,,,,,,
AGDGDTIIFTTLGR,nt,A,28,true,"Stromal N-terminome",96,26371235,"MASCOT Score",75.7600000,,,,,,
AGDGDTIIFTTLGR,nt,A,28,true,"HUNTER N-terminome: legumain, GluC and trypsin",119,31951383,"MaxQuant score",102.4000000,,,,,,
DSSPLHLIYVTER,nt,D,98,true,"Tic56 chloroplast import - tic56-1",89c,25588737,XCorr,3.1209848,,,,,,
RLTPSGVADFSPAVSPSGNLTAVASYGER,ng,N,221,true,"Conserved N-glycosylation",74,22633491,"MaxQuant Score",176.3900000,1.0000000,,,,0,0.4870000
HVELFDLKR,ac,K,348,true,"Quantitative Acetylproteomics",101,29440448,,,,,,,,
VGYHSCR,sno,C,382,false,"hot5-4 / wildtype, FAT-switch S-nitrosoproteome",169,37277371,,,,0.0175848,0.9309464,NO,,
ESPGSGSFELFLIHPNGTGLR,ng,N,586,true,"Conserved N-glycosylation",74,22633491,"MaxQuant Score",148.6800000,1.0000000,,,,1.044000000571E-36,0.0690000
ESPGSGSFELFLIHPNGTGLR,ng,N,586,true,"UDP-GlcNAc transporter glycopeptide analysis",135,30224661,,,,,,,1.5283703191926E-7,0.8000000
CSFEDCHWLNKYPTLK,acy,C,685,true,"Arabidopsis S-acylation atlas - Silique",163e,35681017,,,,,,,,
