Peptide,PTM,ModifiedAA,ModifiedPosition,PeptideUniqueToGene,ExperimentDesc,ExpID,PubmedID,ScoreType,IdentScore,LocProb,Log2FChange,PQ-val,QuantSig,PEP,MassErrorPPM
CQSGYR,sno,C,314,true,"hot5-4 / wildtype, FAT-switch S-nitrosoproteome",169,37277371,,,,,,,,
LDTTTMSCK,sno,C,327,true,"hot5-4 / wildtype, FAT-switch S-nitrosoproteome",169,37277371,,,,,,,,
LSGAGPSNVDVK,ph,S,385,false,"atm and atr DNA damage response",88,25561503,"MASCOT Score",59.0000000,1.0000000,,,,,-0.3400000
LSGAGPSNVDVK,ph,S,385,false,"Tissue atlas Arabidopsis - ProteomicsDB",114,32188942,"MaxQuant score",83.6920000,0.9999920,,,,0.00070293201133609,
IFTEDGMKK,ub,K,403,true,"Ubiquitination Membrane Proteins",120,33585938,,,,,,,,
ILGQGGQGTVYK,ph,T,422,false,"Tissue atlas Arabidopsis - ProteomicsDB",114,32188942,"MaxQuant score",90.8610000,0.9999870,,,,0.0010121800005436,
ILGQGGQGTVYKGILPDNSIVAIKK,ub,K,425,false,"Ubiquitination Membrane Proteins",120,33585938,,,,,,,,
GILPDNSIVAIKK,ub,K,437,false,"Ubiquitination Membrane Proteins",120,33585938,,,,,,,,
IAAECTR,sno,C,661,false,"hot5-4 / wildtype, FAT-switch S-nitrosoproteome",169,37277371,,,,,,,,
