Peptide,PTM,ModifiedAA,ModifiedPosition,PeptideUniqueToGene,ExperimentDesc,ExpID,PubmedID,ScoreType,IdentScore,LocProb,Log2FChange,PQ-val,QuantSig,PEP,MassErrorPPM
MDGNFPQGGVVR,nta,M,1,true,"Arg/N-end rule seed, prt6 vs. Wt",99,29168982,"MASCOT Score",24.5700000,,,,,0.22010000050068,-1.0403799
EKNSVSDDDEPSFTEEGGDGVHNEANR,ph,S,84,true,"Col-0 callus - FC Col-0 vs. Col-0 Xray",111a,31410901,,46.7200000,,0.1261395,0.0000000,NO,,1.5514343
EKNSVSDDDEPSFTEEGGDGVHNEANR,ph,S,84,true,"Col-0 X-ray callus - FC Col-0 vs. Col-0 Xray",111b,31410901,,46.7200000,,0.1261395,0.0000000,NO,,1.5514343
EKNSVSDDDEPSFTEEGGDGVHNEANR,ph,S,84,true,"atm callus - FC atm vs. atm Xray",111c,31410901,,46.7200000,,0.8397578,0.0000000,NO,,1.5514343
EKNSVSDDDEPSFTEEGGDGVHNEANR,ph,S,84,true,"atm-3 X-ray callus - FC atm vs. atm Xray",111d,31410901,,46.7200000,,0.8397578,0.0000000,NO,,1.5514343
EKNSVSDDDEPSFTEEGGDGVHNEANR,ph,S,86,true,"Col-0 callus - FC Col-0 vs. Col-0 Xray",111a,31410901,,58.2100000,,0.7203320,0.0000000,NO,,1.3611367
EKNSVSDDDEPSFTEEGGDGVHNEANR,ph,S,86,true,"Col-0 X-ray callus - FC Col-0 vs. Col-0 Xray",111b,31410901,,58.2100000,,0.7203320,0.0000000,NO,,1.3611367
EKNSVSDDDEPSFTEEGGDGVHNEANR,ph,S,86,true,"atm callus - FC atm vs. atm Xray",111c,31410901,,58.2100000,,0.4877309,0.0000000,NO,,1.3611367
EKNSVSDDDEPSFTEEGGDGVHNEANR,ph,S,86,true,"atm-3 X-ray callus - FC atm vs. atm Xray",111d,31410901,,58.2100000,,0.4877309,0.0000000,NO,,1.3611367
EKNSVSDDDEPSFTEEGGDGVHNEANR,ph,S,86,true,"Tissue atlas Arabidopsis - ProteomicsDB",114,32188942,"MaxQuant score",267.9400000,0.9999840,,,,0,
NSVSDDDEPSFTEEGGDGVHNEANR,ph,S,86,true,"srk2dei ABA signaling phopshoproteomics",83,23572148,"MASCOT Score",34.0000000,,,,,,-0.0002000
NSVSDDDEPSFTEEGGDGVHNEANR,ph,S,86,true,"LAXIC - mannitol vs control",84b,23660473,XCorr,5.0400000,0.7880000,,,,2.8700000257231E-5,
NSVSDDDEPSFTEEGGDGVHNEANR,ph,S,86,true,"TOR Kinase and ABA Receptor",100,29290610,XCorr,5.0830650,0.9993000,,,,3.8239999611278E-8,
NSVSDDDEPSFTEEGGDGVHNEANR,ph,S,86,true,"Lateral root-induction - NAA vs control",106,23328941,"MASCOT Score",68.0000000,,,,,,
NSVSDDDEPSFTEEGGDGVHNEANR,ph,S,86,true,"Col-0 callus - FC Col-0 vs. Col-0 Xray",111a,31410901,,71.7600000,,0.1412150,0.0000000,NO,,1.4720620
NSVSDDDEPSFTEEGGDGVHNEANR,ph,S,86,true,"Col-0 X-ray callus - FC Col-0 vs. Col-0 Xray",111b,31410901,,71.7600000,,0.1412150,0.0000000,NO,,1.4720620
NSVSDDDEPSFTEEGGDGVHNEANR,ph,S,86,true,"atm callus - FC atm vs. atm Xray",111c,31410901,,71.7600000,,0.6676916,0.0000000,NO,,1.4720620
NSVSDDDEPSFTEEGGDGVHNEANR,ph,S,86,true,"atm-3 X-ray callus - FC atm vs. atm Xray",111d,31410901,,71.7600000,,0.6676916,0.0000000,NO,,1.4720620
EKNSVSDDDEPSFTEEGGDGVHNEANR,ph,S,92,true,"Col-0 callus - FC Col-0 vs. Col-0 Xray",111a,31410901,,58.2100000,,0.7203320,0.0000000,NO,,1.3611367
EKNSVSDDDEPSFTEEGGDGVHNEANR,ph,S,92,true,"Col-0 X-ray callus - FC Col-0 vs. Col-0 Xray",111b,31410901,,58.2100000,,0.7203320,0.0000000,NO,,1.3611367
EKNSVSDDDEPSFTEEGGDGVHNEANR,ph,S,92,true,"atm callus - FC atm vs. atm Xray",111c,31410901,,58.2100000,,0.4877309,0.0000000,NO,,1.3611367
EKNSVSDDDEPSFTEEGGDGVHNEANR,ph,S,92,true,"atm-3 X-ray callus - FC atm vs. atm Xray",111d,31410901,,58.2100000,,0.4877309,0.0000000,NO,,1.3611367
NSVSDDDEPSFTEEGGDGVHNEANR,ph,S,92,true,"Lateral root-induction - NAA vs control",106,23328941,"MASCOT Score",26.0000000,,,,,,
NSVSDDDEPSFTEEGGDGVHNEANR,ph,T,94,true,"Lateral root-induction - NAA vs control",106,23328941,"MASCOT Score",35.0000000,,,,,,
VNHYGGGGGPLKK,ac,K,319,true,"Quantitative Acetylproteomics",101,29440448,,,,,,,,
IRPSLSHEDGDHPSHVNSLECNK,ph,S,324,true,"TOR Kinase and ABA Receptor",100,29290610,XCorr,4.3526659,0.8474000,,,,6.4940002630465E-5,
IRPSLSHEDGDHPSHVNSLECNK,ph,S,326,true,"Large-scale phosphorylation discovery",44,23111157,XCorr,5.0630000,,,,,,
IRPSLSHEDGDHPSHVNSLECNK,ph,S,326,true,"Col-0 callus - FC Col-0 vs. Col-0 Xray",111a,31410901,,30.1000000,,2.0794494,0.0000000,NO,,4.4455180
IRPSLSHEDGDHPSHVNSLECNK,ph,S,326,true,"Col-0 X-ray callus - FC Col-0 vs. Col-0 Xray",111b,31410901,,30.1000000,,2.0794494,0.0000000,NO,,4.4455180
IRPSLSHEDGDHPSHVNSLECNK,ph,S,326,true,"atm callus - FC atm vs. atm Xray",111c,31410901,,30.1000000,,-1.4905685,0.0000000,NO,,4.4455180
IRPSLSHEDGDHPSHVNSLECNK,ph,S,326,true,"atm-3 X-ray callus - FC atm vs. atm Xray",111d,31410901,,30.1000000,,-1.4905685,0.0000000,NO,,4.4455180
IRPSLSHEDGDHPSHVNSLECNK,ph,S,326,true,"Tissue atlas Arabidopsis - ProteomicsDB",114,32188942,"MaxQuant score",157.2000000,0.7705050,,,,7.1349493518487E-39,
