Peptide,PTM,ModifiedAA,ModifiedPosition,PeptideUniqueToGene,ExperimentDesc,ExpID,PubmedID,ScoreType,IdentScore,LocProb,Log2FChange,PQ-val,QuantSig,PEP,MassErrorPPM
EYLGGSESDEATTPTK,ph,S,168,true,"atm and atr DNA damage response",88,25561503,"MASCOT Score",37.0000000,1.0000000,,,,,1.0700000
EYLGGSESDEATTPTK,ph,S,168,true,"Tissue atlas Arabidopsis - ProteomicsDB",114,32188942,"MaxQuant score",207.0000000,1.0000000,,,,0,
EYLGGSESDEATTPTK,ph,S,170,true,"atm and atr DNA damage response",88,25561503,"MASCOT Score",37.0000000,1.0000000,,,,,1.0700000
EYLGGSESDEATTPTK,ph,S,170,true,"Tissue atlas Arabidopsis - ProteomicsDB",114,32188942,"MaxQuant score",239.1900000,0.9999910,,,,0,
EYLGGSESDEATTPTK,ph,T,175,true,"Large-scale phosphorylation discovery",44,23111157,XCorr,5.0880000,,,,,,
EYLGGSESDEATTPTK,ph,T,175,true,"atm and atr DNA damage response",88,25561503,"MASCOT Score",38.0000000,0.9370000,,,,,-0.5600000
EYLGGSESDEATTPTK,ph,T,175,true,"Tissue atlas Arabidopsis - ProteomicsDB",114,32188942,"MaxQuant score",293.1400000,0.9482700,,,,0,
LMSGLSISTVR,ph,S,190,true,"atm and atr DNA damage response",88,25561503,"MASCOT Score",59.0000000,0.9950000,,,,,-0.1600000
LMSGLSISTVR,ph,S,190,true,"TOR Kinase and ABA Receptor",100,29290610,XCorr,3.8203332,0.8997000,,,,6.5710000853869E-6,
LMSGLSISTVR,ph,S,190,true,"Tissue atlas Arabidopsis - ProteomicsDB",114,32188942,"MaxQuant score",200.9300000,1.0000000,,,,3.7191300498349E-20,
LMSGLSISTVR,ph,S,193,true,"atm and atr DNA damage response",88,25561503,"MASCOT Score",34.0000000,0.9850000,,,,,-0.2400000
LMSGLSISTVR,ph,S,193,true,"Tissue atlas Arabidopsis - ProteomicsDB",114,32188942,"MaxQuant score",120.8700000,0.9944090,,,,6.6526399677969E-6,
LMSGLSISTVR,ph,S,195,true,"Tissue atlas Arabidopsis - ProteomicsDB",114,32188942,"MaxQuant score",85.5360000,0.8048860,,,,0.00020401600340847,
SSSSGDEGGFSFSPGTPPIYNHR,ph,S,212,true,"Tissue atlas Arabidopsis - ProteomicsDB",114,32188942,"MaxQuant score",224.9300000,0.9839540,,,,0,
SSSSGDEGGFSFSPGTPPIYNHR,ph,S,213,true,"Tissue atlas Arabidopsis - ProteomicsDB",114,32188942,"MaxQuant score",225.9000000,0.8385610,,,,0,
SSSSGDEGGFSFSPGTPPIYNHR,ph,S,222,true,"Tissue atlas Arabidopsis - ProteomicsDB",114,32188942,"MaxQuant score",261.6900000,0.9989310,,,,0,
SSSSGDEGGFSFSPGTPPIYNHR,ph,T,225,true,"Tissue atlas Arabidopsis - ProteomicsDB",114,32188942,"MaxQuant score",266.0000000,0.9989830,,,,0,
