Peptide,PTM,ModifiedAA,ModifiedPosition,PeptideUniqueToGene,ExperimentDesc,ExpID,PubmedID,ScoreType,IdentScore,LocProb,Log2FChange,PQ-val,QuantSig,PEP,MassErrorPPM
ANLGGGAEAHAR,nt,A,2,true,"Tic56 chloroplast import - ppi2",89b,25588737,XCorr,3.1138780,,,,,,
ANLGGGAEAHAR,nt,A,2,true,"Tic56 chloroplast import - tic56-1",89c,25588737,XCorr,2.9143026,,,,,,
ANLGGGAEAHAR,nt,A,2,true,"Arg/N-end rule seed, prt6 vs. Wt",99,29168982,"MASCOT Score",39.5700000,,,,,0.062710002064705,1.0851781
ANLGGGAEAHAR,nt,A,2,true,"FtsH12 N-terminome: WT / FtsH12 knockdown miRNA",118,33216923,"MaxQuant score",61.2120000,,,,,0.013600000180304,
ANLGGGAEAHARF,nta,A,2,true,"Arabidopsis translation initiation landscape - NTA",167a,35069635,,,,,,,,
ANLGGGAEAHAR,nta,A,2,true,"Arg/N-end rule pathway Roots",80,25728785,"MASCOT Score",54.4400000,,,,,0.010180000215769,
ANLGGGAEAHAR,nta,A,2,true,"Tic56 chloroplast import - ppi2",89b,25588737,XCorr,3.1138780,,,,,,
ANLGGGAEAHAR,nta,A,2,true,"Tic56 chloroplast import - tic56-1",89c,25588737,XCorr,2.9143026,,,,,,
ANLGGGAEAHAR,nta,A,2,true,"Arg/N-end rule seed, prt6 vs. Wt",99,29168982,"MASCOT Score",39.5700000,,,,,0.062710002064705,1.0851781
ANSSLVLTTDNRPR,ph,S,23,true,"atm and atr DNA damage response",88,25561503,"MASCOT Score",39.0000000,0.9940000,,,,,-0.3300000
ANSSLVLTTDNRPR,ph,S,23,true,"TOR Kinase and ABA Receptor",100,29290610,XCorr,3.4532647,0.9091000,,,,0.0010539999930188,
ANSSLVLTTDNRPR,ph,S,23,true,"Tissue atlas Arabidopsis - ProteomicsDB",114,32188942,"MaxQuant score",163.4100000,0.9988920,,,,1.5569800657089E-11,
ANSSLVLTTDNRPR,ph,S,24,true,"Tissue atlas Arabidopsis - ProteomicsDB",114,32188942,"MaxQuant score",87.8080000,0.8865410,,,,0.0001616829977138,
DVVDDMVNIRQSK,ph,S,91,true,"Tissue atlas Arabidopsis - ProteomicsDB",114,32188942,"MaxQuant score",144.3000000,1.0000000,,,,2.6427098873683E-6,
LREESVLTDTDDAVYQPK,ph,S,100,true,"TOR Kinase and ABA Receptor",100,29290610,XCorr,5.2754393,0.9989000,,,,6.0729998949682E-5,
LREESVLTDTDDAVYQPK,ph,S,100,true,"Col-0 callus - FC Col-0 vs. Col-0 Xray",111a,31410901,,66.6100000,,-0.0281622,0.0000000,NO,,1.6784391
LREESVLTDTDDAVYQPK,ph,S,100,true,"Col-0 X-ray callus - FC Col-0 vs. Col-0 Xray",111b,31410901,,66.6100000,,-0.0281622,0.0000000,NO,,1.6784391
LREESVLTDTDDAVYQPK,ph,S,100,true,"atm callus - FC atm vs. atm Xray",111c,31410901,,66.6100000,,1.6673566,0.0000000,NO,,1.6784391
LREESVLTDTDDAVYQPK,ph,S,100,true,"atm-3 X-ray callus - FC atm vs. atm Xray",111d,31410901,,66.6100000,,1.6673566,0.0000000,NO,,1.6784391
EESVLTDTDDAVYQPK,ph,S,100,true,"Tissue atlas Arabidopsis - ProteomicsDB",114,32188942,"MaxQuant score",225.5000000,1.0000000,,,,0,
LREESVLTDTDDAVYQPK,ph,T,103,true,"Tissue atlas Arabidopsis - ProteomicsDB",114,32188942,"MaxQuant score",140.9700000,0.9928170,,,,1.3359600155739E-14,
LITDFQEGGDSGGGR,ph,S,196,true,"atm and atr DNA damage response",88,25561503,"MASCOT Score",70.0000000,1.0000000,,,,,-0.5000000
LITDFQEGGDSGGGR,ph,S,196,true,"Lateral root-induction - NAA vs control",106,23328941,"MASCOT Score",32.0000000,,,,,,
LITDFQEGGDSGGGR,ph,S,196,true,"Tissue atlas Arabidopsis - ProteomicsDB",114,32188942,"MaxQuant score",230.9700000,1.0000000,,,,0,
EENLQKSINEEAR,me1,K,393,true,"Arabidopsis protein methylome",123,31809900,"MaxQuant Score",119.5400000,1.0000000,,,,2.9017800396705E-14,0.5220000
DVADRDSESGWVK,ph,S,422,true,"atm and atr DNA damage response",88,25561503,"MASCOT Score",41.0000000,1.0000000,,,,,-0.2300000
DVADRDSESGWVK,ph,S,422,true,"Tissue atlas Arabidopsis - ProteomicsDB",114,32188942,"MaxQuant score",158.1400000,0.9975930,,,,1.0073200051863E-9,
AENILLCAPTGAGK,so,C,526,true,"S-sulfenylation site detection using YAP1C",110,32714340,,,,,,,,
FLKEDSVTR,ph,S,780,true,"Tissue atlas Arabidopsis - ProteomicsDB",114,32188942,"MaxQuant score",89.1890000,0.9414770,,,,0.0019178499933332,
CTDPHVK,sno,C,1911,true,"hot5-4 / wildtype, FAT-switch S-nitrosoproteome",169,37277371,,,,,,,,
CTDPHVK,so,C,1911,true,"S-sulfenylation site detection using YAP1C",110,32714340,,,,,,,,
TNQLLAIKR,ac,K,2113,true,"Quantitative Acetylproteomics",101,29440448,,,,,,,,
