Peptide,PTM,ModifiedAA,ModifiedPosition,PeptideUniqueToGene,ExperimentDesc,ExpID,PubmedID,ScoreType,IdentScore,LocProb,Log2FChange,PQ-val,QuantSig,PEP,MassErrorPPM
MDSDFGIPRELSPLQQL,nta,M,1,false,"Arabidopsis translation initiation landscape - NTA",167a,35069635,,,,,,,,
MDSDFGIPRE,nta,M,1,false,"N-term acetylation drought responses",5,26184543,,,,,,,,
MDSDFGIPRE,nta,M,1,false,"HUNTER N-terminome: legumain, GluC and trypsin",119,31951383,"MaxQuant score",113.2200000,,,,,,
MDSDFGIPR,nta,M,1,false,"Arg/N-end rule pathway Roots",80,25728785,"MASCOT Score",47.6500000,,,,,0.0024000001139939,
MDSDFGIPR,nta,M,1,false,"Arg/N-end rule seed, prt6 vs. Wt",99,29168982,"MASCOT Score",64.9700000,,,,,0.022450000047684,0.3645498
MDSDFGIPR,nta,M,1,false,"FtsH12 N-terminome: WT / FtsH12 knockdown miRNA",118,33216923,"MaxQuant score",82.6510000,,,,,0,
MDSDFGIPR,nta,M,1,false,"HUNTER N-terminome: legumain, GluC and trypsin",119,31951383,"MaxQuant score",170.6600000,,,,,,
ELSPLQQLR,ph,S,12,false,"Tissue atlas Arabidopsis - ProteomicsDB",114,32188942,"MaxQuant score",183.4300000,1.0000000,,,,6.7041401052848E-7,
SQYKPELPPCLQGTTVR,sno,C,28,true,"Site-specific nitrosomeproteomic id - gsnor1-3",90a,25699590,XCorr,3.2709494,,,,,0.084739997982979,-6.6307671
SQYKPELPPCLQGTTVR,sno,C,28,true,"Site-specific nitrosomeproteomic id - gsnor1-3",90b,25699590,XCorr,3.3400000,,,,,0.017039999365807,-5.9300000
ETAQVPDAH,nt,E,71,true,"Arg/N-end rule seed, prt6 vs. Wt",99,29168982,"MASCOT Score",34.3400000,,0.1992093,0.7576690,NO,0.16249999403954,0.2760742
VGIVFCGR,acy,C,94,false,"Arabidopsis S-acylation atlas - Meristem",163a,35681017,,,,,,,,
VGIVFCGR,so,C,94,false,"Arabidopsis S-sulfenylation chemoproteomics",108,31578252,"pFind PSM Score",0.0048447,,0.8454300,,,,-1.4543711
VNSQLISNACTDALSAEK,ox,C,249,true,"SPEAR - 10 mM H2O2 / mock",138a,34619326,,,,1.4687424,0.0079481,YES,,
VNSQLISNACTDALSAEK,sno,C,249,true,"Site-specific nitrosomeproteomic id - gsnor1-3",90a,25699590,XCorr,3.2159884,,,,,5.4610000006505E-6,-7.3332370
VNSQLISNACTDALSAEK,sno,C,249,true,"Site-specific nitrosomeproteomic id - gsnor1-3",90b,25699590,XCorr,2.6700000,,,,,0.00013299999409355,-6.8100000
VNSQLISNACTDALSAEK,sno,C,249,true,"hot5-4 / wildtype, FAT-switch S-nitrosoproteome",169,37277371,,,,-0.4364763,0.1173056,NO,,
QICDAVQAR,sno,C,306,false,"hot5-4 / wildtype, FAT-switch S-nitrosoproteome",169,37277371,,,,,,,,
QICDAVQAR,so,C,306,false,"Arabidopsis S-sulfenylation chemoproteomics",108,31578252,"pFind PSM Score",0.0787843,,1.1983600,,,,1.1550109
QICDAVQAR,so,C,306,false,"S-sulfenylation site detection using YAP1C",110,32714340,,,,,,,,
SPVNKWK,ub,K,476,false,"upl3 mutant / wildtype",168,35926874,"MaxQuant score",92.1870000,1.0000000,0.9145645,0.2907800,NO,0.032188799232244,-0.3486800
AVSLCVEDQDYMGR,acy,C,558,true,"Arabidopsis S-acylation atlas - Meristem",163a,35681017,,,,,,,,
AVSLCVEDQDYMGR,sno,C,558,true,"hot5-4 / wildtype, FAT-switch S-nitrosoproteome",169,37277371,,,,-0.0911551,0.5484416,NO,,
VEDQDYMGR,nt,V,559,true,"Arg/N-end rule seed, prt6 vs. Wt",99,29168982,"MASCOT Score",24.4200000,,-0.7896952,0.0000641,NO,0.21230000257492,-0.9451239
KLQEYLDQVR,ub,K,570,false,"upl3 mutant / wildtype",168,35926874,"MaxQuant score",121.9000000,1.0000000,1.0908534,0.1985840,NO,0.00022251000336837,-0.2339200
TIVKPGCSQDVLK,sno,C,586,false,"Site-specific nitrosomeproteomic id - gsnor1-3",90a,25699590,XCorr,3.1339066,,,,,0.0032220000866801,-6.0177363
TIVKPGCSQDVLK,sno,C,586,false,"Site-specific nitrosomeproteomic id - gsnor1-3",90b,25699590,XCorr,2.9500000,,,,,0.119099996984,-6.8100000
TIVKPGCSQDVLK,sno,C,586,false,"hot5-4 / wildtype, FAT-switch S-nitrosoproteome",169,37277371,,,,,,,,
TIVKPGCSQDVLK,so,C,586,false,"Arabidopsis S-sulfenylation chemoproteomics",108,31578252,"pFind PSM Score",0.0054174,,0.9687000,,,,0.7456204
TIVKPGCSQDVLK,so,C,586,false,"S-sulfenylation site detection using YAP1C",110,32714340,,,,,,,,
