Peptide,PTM,ModifiedAA,ModifiedPosition,PeptideUniqueToGene,ExperimentDesc,ExpID,PubmedID,ScoreType,IdentScore,LocProb,Log2FChange,PQ-val,QuantSig,PEP,MassErrorPPM
RVQMLSPK,ph,S,77,true,"atm and atr DNA damage response",88,25561503,"MASCOT Score",34.0000000,1.0000000,,,,,-1.2300000
VQMLSPK,ph,S,77,true,"TOR Kinase and ABA Receptor",100,29290610,XCorr,2.4850378,1.0000000,,,,0.0047670002095401,
VQMLSPK,ph,S,77,true,"Tissue atlas Arabidopsis - ProteomicsDB",114,32188942,"MaxQuant score",158.7600000,1.0000000,,,,0.00041130400495604,
VQMLSPKTEGENAKKR,ac,K,79,true,"Histone deacetylases substrates - hda14 vs WT",98e,29061669,"MaxQuant Score",112.2000000,1.0000000,-0.0190000,0.9772372,NO,2.3000000123137E-17,
VQMLSPKTEGENAKK,ac,K,79,true,"Histone deacetylases - apicidin vs control",98a,29061669,"MaxQuant Score",78.3000000,1.0000000,0.9960000,0.0033113,YES,4.8999998398358E-5,
RVQMLSPKTEGENAK,ac,K,79,true,"Quantitative Acetylproteomics",101,29440448,,,,,,,,
VQMLSPKTEGENAK,ac,K,79,true,"Quantitative Acetylproteomics",101,29440448,,,,,,,,
VQMLSPKTEGENAKKR,ac,K,86,true,"Histone deacetylases substrates - hda14 vs WT",98e,29061669,"MaxQuant Score",112.2000000,1.0000000,-0.0190000,0.9772372,NO,2.3000000123137E-17,
VQMLSPKTEGENAKK,ac,K,86,true,"Histone deacetylases - apicidin vs control",98a,29061669,"MaxQuant Score",78.3000000,1.0000000,0.9960000,0.0033113,YES,4.8999998398358E-5,
TEGENAKKR,ac,K,86,true,"Quantitative Acetylproteomics",101,29440448,,,,,,,,
TEGENAKK,ac,K,86,true,"Quantitative Acetylproteomics",101,29440448,,,,,,,,
VQMLSPKTEGENAKKR,ac,K,87,true,"Histone deacetylases substrates - hda14 vs WT",98e,29061669,"MaxQuant Score",112.2000000,1.0000000,-0.0190000,0.9772372,NO,2.3000000123137E-17,
TEGENAKKR,ac,K,87,true,"Quantitative Acetylproteomics",101,29440448,,,,,,,,
LVGSGEVTAPAVK,ph,S,250,true,"Tissue atlas Arabidopsis - ProteomicsDB",114,32188942,"MaxQuant score",97.2730000,0.9999940,,,,0.00024442400899716,
GLISTPK,ph,T,266,true,"Tissue atlas Arabidopsis - ProteomicsDB",114,32188942,"MaxQuant score",164.6800000,0.9983960,,,,0.00061150500550866,
QQTSMDHVVTNEADK,ph,T,284,true,"atm and atr DNA damage response",88,25561503,"MASCOT Score",30.0000000,0.9600000,,,,,0.2000000
QQTSMDHVVTNEADK,ph,S,285,true,"Tissue atlas Arabidopsis - ProteomicsDB",114,32188942,"MaxQuant score",98.6760000,0.8682470,,,,2.1943600586383E-5,
