Peptide,PTM,ModifiedAA,ModifiedPosition,PeptideUniqueToGene,ExperimentDesc,ExpID,PubmedID,ScoreType,IdentScore,LocProb,Log2FChange,PQ-val,QuantSig,PEP,MassErrorPPM
AGQNPNMDQFEAYFKR,nta,A,2,true,"HUNTER N-terminome: legumain, GluC and trypsin",119,31951383,"MaxQuant score",,,,,,,
AGQNPNMDQFEAYFKR,nta,A,2,true,"Arabidopsis translation initiation landscape - NTA",167a,35069635,,,,,,,,
AGQNPNMDQFE,nta,A,2,true,"HUNTER N-terminome: legumain, GluC and trypsin",119,31951383,"MaxQuant score",90.2630000,,,,,,
LVTVAQSKR,ub,K,78,true,"Arabidopsis ubiquitination COFRADIC",40,26744219,"MaxQuant Score",62.4630000,1.0000000,,,,0.018999999389052,0.7430000
ALVVSGNGGDMFSSFQQK,ph,S,259,true,"Tissue atlas Arabidopsis - ProteomicsDB",114,32188942,"MaxQuant score",236.1600000,0.9671820,,,,0,
EAETLAKK,me2,K,595,true,"Arabidopsis protein methylome",123,31809900,"MaxQuant Score",144.0900000,1.0000000,,,,2.0398499851596E-14,0.6690400
KYEEKYK,ac,K,600,false,"Quantitative Acetylproteomics",101,29440448,,,,,,,,
ENGTVDDGSGPPDSPTHVEDNYGPFSETSDR,ph,T,731,true,"Lateral root-induction - NAA vs control",106,23328941,"MASCOT Score",21.0000000,,,,,,
ENGTVDDGSGPPDSPTHVEDNYGPFSETSDR,ph,S,736,true,"Large-scale phosphorylation discovery",44,23111157,XCorr,3.3260000,,,,,,
ENGTVDDGSGPPDSPTHVEDNYGPFSETSDR,ph,S,741,true,"Phytohormone-responsive phosphoproteins",34,20374526,"MASCOT Score",51.0000000,,,,,,4.0862100
ENGTVDDGSGPPDSPTHVEDNYGPFSETSDR,ph,S,741,true,"srk2dei ABA signaling phopshoproteomics",83,23572148,"MASCOT Score",82.0000000,,,,,,0.0003000
ENGTVDDGSGPPDSPTHVEDNYGPFSETSDR,ph,S,741,true,"TOR Kinase and ABA Receptor",100,29290610,XCorr,5.7519398,0.9749000,,,,2.7420001060818E-6,
ENGTVDDGSGPPDSPTHVEDNYGPFSETSDR,ph,S,741,true,"Lateral root-induction - NAA vs control",106,23328941,"MASCOT Score",40.0000000,,,,,,
ENGTVDDGSGPPDSPTHVEDNYGPFSETSDR,ph,S,741,true,"Col-0 callus - FC Col-0 vs. Col-0 Xray",111a,31410901,,48.1400000,,0.9046026,0.0000000,NO,,1.2242539
ENGTVDDGSGPPDSPTHVEDNYGPFSETSDR,ph,S,741,true,"Col-0 X-ray callus - FC Col-0 vs. Col-0 Xray",111b,31410901,,48.1400000,,0.9046026,0.0000000,NO,,1.2242539
ENGTVDDGSGPPDSPTHVEDNYGPFSETSDR,ph,S,741,true,"atm callus - FC atm vs. atm Xray",111c,31410901,,48.1400000,,1.4742010,0.0000000,NO,,1.2242539
ENGTVDDGSGPPDSPTHVEDNYGPFSETSDR,ph,S,741,true,"atm-3 X-ray callus - FC atm vs. atm Xray",111d,31410901,,48.1400000,,1.4742010,0.0000000,NO,,1.2242539
ENGTVDDGSGPPDSPTHVEDNYGPFSETSDR,ph,S,741,true,"Tissue atlas Arabidopsis - ProteomicsDB",114,32188942,"MaxQuant score",324.2900000,0.9989410,,,,0,
SKEQNSSGEKENGTVDDGSGPPDSPTHVEDNYGPFSETSDR,ph,T,743,true,"Tissue atlas Arabidopsis - ProteomicsDB",114,32188942,"MaxQuant score",124.6300000,0.8002720,,,,0,
ENGTVDDGSGPPDSPTHVEDNYGPFSETSDR,ph,T,743,true,"srk2dei ABA signaling phopshoproteomics",83,23572148,"MASCOT Score",73.0000000,,,,,,-0.0028000
ENGTVDDGSGPPDSPTHVEDNYGPFSETSDR,ph,T,743,true,"Lateral root-induction - NAA vs control",106,23328941,"MASCOT Score",39.0000000,,,,,,
HHESEYGTTHSEDRSPR,ph,S,769,true,"TOR Kinase and ABA Receptor",100,29290610,XCorr,3.3206024,0.8343000,,,,0.014890000224113,
HHESEYGTTHSEDRSPR,ph,S,769,true,"Tissue atlas Arabidopsis - ProteomicsDB",114,32188942,"MaxQuant score",220.3600000,0.9888270,,,,0,
HHESEYGTTHSEDRSPRDSPVSR,ph,S,773,true,"TOR Kinase and ABA Receptor",100,29290610,XCorr,4.0100145,0.8578000,,,,0.0009437000262551,
HHESEYGTTHSEDRSPRDSPVSR,ph,S,773,true,"Tissue atlas Arabidopsis - ProteomicsDB",114,32188942,"MaxQuant score",269.0800000,0.9999390,,,,0,
HHESEYGTTHSEDRSPR,ph,S,773,true,"SnRK2 protein kinase substrates",85,23776212,XCorr,2.4648795,0.8320000,,,,0.019864000380039,
HHESEYGTTHSEDRSPR,ph,S,773,true,"TOR Kinase and ABA Receptor",100,29290610,XCorr,3.7257307,0.9470000,,,,0.0016929999692366,
HHESEYGTTHSEDRSPR,ph,S,773,true,"Phospho cell culture sucrose/TOR",109,30833711,,,0.9803430,,,,,
HHESEYGTTHSEDRSPR,ph,S,773,true,"Col-0 callus - FC Col-0 vs. Col-0 Xray",111a,31410901,,42.4300000,,-0.5365345,0.0000000,NO,,0.2869845
HHESEYGTTHSEDRSPR,ph,S,773,true,"Col-0 X-ray callus - FC Col-0 vs. Col-0 Xray",111b,31410901,,42.4300000,,-0.5365345,0.0000000,NO,,0.2869845
HHESEYGTTHSEDRSPR,ph,S,773,true,"atm callus - FC atm vs. atm Xray",111c,31410901,,42.4300000,,4.6807150,0.0000000,NO,,0.2869845
HHESEYGTTHSEDRSPR,ph,S,773,true,"atm-3 X-ray callus - FC atm vs. atm Xray",111d,31410901,,42.4300000,,4.6807150,0.0000000,NO,,0.2869845
HHESEYGTTHSEDRSPRDSPVSR,ph,S,777,true,"TOR Kinase and ABA Receptor",100,29290610,XCorr,4.0100145,0.9845000,,,,0.0009437000262551,
HHESEYGTTHSEDRSPRDSPVSR,ph,S,777,true,"Phospho cell culture sucrose/TOR",109,30833711,,,0.9745910,,,,,
HHESEYGTTHSEDRSPRDSPVSR,ph,S,777,true,"Tissue atlas Arabidopsis - ProteomicsDB",114,32188942,"MaxQuant score",224.2700000,0.9990360,,,,0,
SPRDSPVSR,ph,S,777,true,"atm and atr DNA damage response",88,25561503,"MASCOT Score",20.0000000,1.0000000,,,,,1.0300000
HHESEYGTTHSEDRSPRDSPVSR,ph,S,780,true,"TOR Kinase and ABA Receptor",100,29290610,XCorr,3.2893465,0.9224000,,,,0.03285999968648,
NATEVPSPDYSQGK,ph,T,784,true,"Tissue atlas Arabidopsis - ProteomicsDB",114,32188942,"MaxQuant score",116.8600000,1.0000000,,,,0.0002789220015984,
NATEVPSPDYSQGK,ph,S,788,true,"Arabidopsis root NAA phosphoproteome",18a,27643528,"MaxQuant Score",64.1040000,0.9520000,,,,6.0970000049565E-5,0.0910000
NATEVPSPDYSQGK,ph,S,788,true,"Phosphorylation nuclei-enriched fractions",28,19245862,,,,,,,,
NATEVPSPDYSQGK,ph,S,788,true,"STN8 phosphoproteome",38,21768351,"MASCOT Score",64.4100000,,,,,,-0.8136310
NATEVPSPDYSQGK,ph,S,788,true,"Phosphoproteomic analysis of seed maturation",42,22440515,"MASCOT Score",50.0000000,,,,,,3.3100000
NATEVPSPDYSQGK,ph,S,788,true,"Large-scale phosphorylation discovery",44,23111157,XCorr,3.9130000,,,,,,
NATEVPSPDYSQGK,ph,S,788,true,"Phosphoproteome ethylene-regulated time response",46,24043427,"MASCOT Score",30.6400000,,,,,,2.4359000
NATEVPSPDYSQGK,ph,S,788,true,"Tyrosine phosphorylation in Arabidopsis",59,18463617,"MASCOT Score",40.0000000,,,,,,0.8907825
NATEVPSPDYSQGK,ph,S,788,true,"Chloroplast kinase substrates",60,19376835,"MASCOT Score",45.2300000,,,,,,-0.7119570
NATEVPSPDYSQGK,ph,S,788,true,"srk2dei ABA signaling phopshoproteomics",83,23572148,"MASCOT Score",53.0000000,,,,,,-0.0012000
NATEVPSPDYSQGK,ph,S,788,true,"LAXIC - mannitol vs control",84b,23660473,XCorr,2.8900000,0.8990000,-1.5342768,,NO,0.0064691798761487,
NATEVPSPDYSQGK,ph,S,788,true,"SnRK2 protein kinase substrates",85,23776212,XCorr,2.9756966,0.9960000,,,,3.0434499421972E-5,
NATEVPSPDYSQGK,ph,S,788,true,"SIRK1 phosphorylation",86a,23820729,"MaxQuant Score",170.4400000,1.0000000,,,,4.1300001612399E-5,0.7500000
NATEVPSPDYSQGK,ph,S,788,true,"SIRK1 exp - sirk1 mutant vs WT",86b,23820729,,,,-0.0041166,,NO,,
NATEVPSPDYSQGK,ph,S,788,true,"atm and atr DNA damage response",88,25561503,"MASCOT Score",80.0000000,0.9970000,,,,,0.6800000
NATEVPSPDYSQGK,ph,S,788,true,"TOR Kinase and ABA Receptor",100,29290610,XCorr,3.3994727,0.9095000,,,,0.0026159998960793,
NATEVPSPDYSQGK,ph,S,788,true,"Lateral root-induction - NAA vs control",106,23328941,"MASCOT Score",63.0000000,,-0.1202865,0.5159375,NO,,
NATEVPSPDYSQGK,ph,S,788,true,"Phospho cell culture sucrose/TOR",109,30833711,,,0.9991320,,,,,
NATEVPSPDYSQGK,ph,S,788,true,"Col-0 callus - FC Col-0 vs. Col-0 Xray",111a,31410901,,72.7200000,,0.2087687,0.0000000,NO,,0.7254330
NATEVPSPDYSQGK,ph,S,788,true,"Col-0 X-ray callus - FC Col-0 vs. Col-0 Xray",111b,31410901,,72.7200000,,0.2087687,0.0000000,NO,,0.7254330
NATEVPSPDYSQGK,ph,S,788,true,"atm callus - FC atm vs. atm Xray",111c,31410901,,72.7200000,,-0.5395115,0.0000000,NO,,0.7254330
NATEVPSPDYSQGK,ph,S,788,true,"atm-3 X-ray callus - FC atm vs. atm Xray",111d,31410901,,72.7200000,,-0.5395115,0.0000000,NO,,0.7254330
NATEVPSPDYSQGK,ph,S,788,true,"Tissue atlas Arabidopsis - ProteomicsDB",114,32188942,"MaxQuant score",206.2000000,0.9998500,,,,3.7652889736408E-42,
NATEVPSPDYSQGK,ph,S,788,true,"Touch-induced phosphorylation: 40s touch vs untouc",136,30291188,"MASCOT score",65.0200000,,0.3224169,0.7277336,NO,,8.1358756
NATEVPSPDYSQGK,ph,Y,791,true,"Tyrosine phosphorylation in Arabidopsis",59,18463617,"MASCOT Score",32.0000000,,,,,,-1.0180391
NATEVPSPDYSQGK,ph,Y,791,true,"srk2dei ABA signaling phopshoproteomics",83,23572148,"MASCOT Score",54.0000000,,,,,,-0.0003000
NATEVPSPDYSQGK,ph,Y,791,true,"Lateral root-induction - NAA vs control",106,23328941,"MASCOT Score",25.0000000,,,,,,
NATEVPSPDYSQGK,ph,S,792,true,"SIRK1 phosphorylation",86a,23820729,"MaxQuant Score",66.6360000,0.8620000,,,,1.0540000200272,0.9260000
NATEVPSPDYSQGK,ph,S,792,true,"atm and atr DNA damage response",88,25561503,"MASCOT Score",52.0000000,0.9600000,,,,,-0.2400000
NATEVPSPDYSQGK,ph,S,792,true,"Lateral root-induction - NAA vs control",106,23328941,"MASCOT Score",21.0000000,,,,,,
NATEVPSPDYSQGK,ph,S,792,true,"Tissue atlas Arabidopsis - ProteomicsDB",114,32188942,"MaxQuant score",144.7300000,0.9975680,,,,5.0228300096933E-7,
SQDGDYFGSGDDFGGNTAR,ph,S,826,true,"ABA-induced protein phosphorylation",35,20733066,,,,,,,,
SQDGDYFGSGDDFGGNTAR,ph,S,826,true,"STN8 phosphoproteome",38,21768351,"MASCOT Score",76.6800000,,,,,,-0.8962380
SQDGDYFGSGDDFGGNTAR,ph,S,826,true,"srk2dei ABA signaling phopshoproteomics",83,23572148,"MASCOT Score",95.0000000,,,,,,-0.0008000
SQDGDYFGSGDDFGGNTAR,ph,S,826,true,"LAXIC - mannitol vs control",84b,23660473,XCorr,5.3600000,1.0000000,,,,9.8600001861154E-13,
SQDGDYFGSGDDFGGNTAR,ph,S,826,true,"atm and atr DNA damage response",88,25561503,"MASCOT Score",56.0000000,0.9970000,,,,,-0.2100000
SQDGDYFGSGDDFGGNTAR,ph,S,826,true,"TOR Kinase and ABA Receptor",100,29290610,XCorr,5.2275348,1.0000000,,,,6.5339996524472E-8,
SQDGDYFGSGDDFGGNTAR,ph,S,826,true,"Lateral root-induction - NAA vs control",106,23328941,"MASCOT Score",77.0000000,,0.0852870,0.7899116,NO,,
SQDGDYFGSGDDFGGNTAR,ph,S,826,true,"Phospho cell culture sucrose/TOR",109,30833711,,,1.0000000,,,,,
SQDGDYFGSGDDFGGNTAR,ph,S,826,true,"Col-0 callus - FC Col-0 vs. Col-0 Xray",111a,31410901,,130.5600000,,0.5635111,0.0000000,NO,,1.1841825
SQDGDYFGSGDDFGGNTAR,ph,S,826,true,"Col-0 X-ray callus - FC Col-0 vs. Col-0 Xray",111b,31410901,,130.5600000,,0.5635111,0.0000000,NO,,1.1841825
SQDGDYFGSGDDFGGNTAR,ph,S,826,true,"atm callus - FC atm vs. atm Xray",111c,31410901,,130.5600000,,0.9023016,0.0000000,NO,,1.1841825
SQDGDYFGSGDDFGGNTAR,ph,S,826,true,"atm-3 X-ray callus - FC atm vs. atm Xray",111d,31410901,,130.5600000,,0.9023016,0.0000000,NO,,1.1841825
SQDGDYFGSGDDFGGNTAR,ph,S,826,true,"Tissue atlas Arabidopsis - ProteomicsDB",114,32188942,"MaxQuant score",356.3700000,1.0000000,,,,0,
SQDGDYFGSGDDFGGNTAR,ph,S,826,true,"Touch-induced phosphorylation: 40s touch vs untouc",136,30291188,"MASCOT score",121.6900000,,0.0265147,0.8917794,NO,,4.5935931
SQDGDYFGSGDDFGGNTAR,ph,Y,831,true,"Tissue atlas Arabidopsis - ProteomicsDB",114,32188942,"MaxQuant score",83.0870000,0.9113230,,,,0.00016059800691437,
SQDGDYFGSGDDFGGNTAR,ph,S,834,true,"Lateral root-induction - NAA vs control",106,23328941,"MASCOT Score",36.0000000,,,,,,
SQDGDYFGSGDDFGGNTAR,ph,S,834,true,"Tissue atlas Arabidopsis - ProteomicsDB",114,32188942,"MaxQuant score",201.8500000,0.9999990,,,,0,
SQDGDYFGSGDDFGGNTAR,ph,T,842,true,"Large-scale phosphorylation discovery",44,23111157,XCorr,4.4140000,,,,,,
SQDGDYFGSGDDFGGNTAR,ph,T,842,true,"Tissue atlas Arabidopsis - ProteomicsDB",114,32188942,"MaxQuant score",260.0600000,1.0000000,,,,0,
KSQFAFDDSVPSTPLSR,ph,S,859,true,"Tissue atlas Arabidopsis - ProteomicsDB",114,32188942,"MaxQuant score",153.8600000,0.9999650,,,,1.3936900244982E-10,
SQFAFDDSVPSTPLSR,ph,S,866,true,"STN8 phosphoproteome",38,21768351,"MASCOT Score",46.8900000,,,,,,-1.7535200
SQFAFDDSVPSTPLSR,ph,S,866,true,"Chloroplast kinase substrates",60,19376835,"MASCOT Score",34.4700000,,,,,,-1.5387600
SQFAFDDSVPSTPLSR,ph,S,866,true,"srk2dei ABA signaling phopshoproteomics",83,23572148,"MASCOT Score",28.0000000,,,,,,0.0031000
SQFAFDDSVPSTPLSR,ph,S,866,true,"SnRK2 protein kinase substrates",85,23776212,XCorr,2.2109945,0.9990000,,,,0.0038733000401407,
SQFAFDDSVPSTPLSR,ph,S,866,true,"atm and atr DNA damage response",88,25561503,"MASCOT Score",42.0000000,1.0000000,,,,,-0.2500000
SQFAFDDSVPSTPLSR,ph,S,866,true,"TOR Kinase and ABA Receptor",100,29290610,XCorr,4.6861868,0.9973000,,,,0.00022719999833498,
SQFAFDDSVPSTPLSR,ph,S,866,true,"Lateral root-induction - NAA vs control",106,23328941,"MASCOT Score",26.0000000,,0.1586760,0.5683574,NO,,
SQFAFDDSVPSTPLSR,ph,S,866,true,"Phospho cell culture sucrose/TOR",109,30833711,,,0.9554380,,,,,
SQFAFDDSVPSTPLSR,ph,S,866,true,"Col-0 callus - FC Col-0 vs. Col-0 Xray",111a,31410901,,34.8900000,,1.2861202,0.0000000,NO,,0.8951392
SQFAFDDSVPSTPLSR,ph,S,866,true,"Col-0 X-ray callus - FC Col-0 vs. Col-0 Xray",111b,31410901,,34.8900000,,1.2861202,0.0000000,NO,,0.8951392
SQFAFDDSVPSTPLSR,ph,S,866,true,"atm callus - FC atm vs. atm Xray",111c,31410901,,34.8900000,,1.9878260,0.0000000,NO,,0.8951392
SQFAFDDSVPSTPLSR,ph,S,866,true,"atm-3 X-ray callus - FC atm vs. atm Xray",111d,31410901,,34.8900000,,1.9878260,0.0000000,NO,,0.8951392
SQFAFDDSVPSTPLSR,ph,S,866,true,"Tissue atlas Arabidopsis - ProteomicsDB",114,32188942,"MaxQuant score",211.2600000,0.9999990,,,,0,
KSQFAFDDSVPSTPLSR,ph,S,869,true,"Large-scale phosphorylation discovery",44,23111157,XCorr,4.2900000,,,,,,
KSQFAFDDSVPSTPLSR,ph,S,869,true,"Tissue atlas Arabidopsis - ProteomicsDB",114,32188942,"MaxQuant score",272.8000000,0.8457370,,,,0,
SQFAFDDSVPSTPLSR,ph,S,869,true,"atm and atr DNA damage response",88,25561503,"MASCOT Score",20.0000000,0.9890000,,,,,-0.0700000
SQFAFDDSVPSTPLSR,ph,S,869,true,"Lateral root-induction - NAA vs control",106,23328941,"MASCOT Score",26.0000000,,0.1586760,0.5683574,NO,,
KSQFAFDDSVPSTPLSR,ph,T,870,true,"Large-scale phosphorylation discovery",44,23111157,XCorr,4.2320000,,,,,,
KSQFAFDDSVPSTPLSR,ph,T,870,true,"Tissue atlas Arabidopsis - ProteomicsDB",114,32188942,"MaxQuant score",402.8300000,0.9923810,,,,0,
SQFAFDDSVPSTPLSR,ph,T,870,true,"Large-scale phosphorylation discovery",44,23111157,XCorr,5.3350000,,,,,,
SQFAFDDSVPSTPLSR,ph,T,870,true,"Chloroplast kinase substrates",60,19376835,"MASCOT Score",34.4700000,,,,,,-1.5387600
SQFAFDDSVPSTPLSR,ph,T,870,true,"atm and atr DNA damage response",88,25561503,"MASCOT Score",42.0000000,1.0000000,,,,,-0.2500000
SQFAFDDSVPSTPLSR,ph,T,870,true,"Lateral root-induction - NAA vs control",106,23328941,"MASCOT Score",47.0000000,,-0.2009337,0.3074991,NO,,
SQFAFDDSVPSTPLSR,ph,T,870,true,"Col-0 callus - FC Col-0 vs. Col-0 Xray",111a,31410901,,37.0600000,,-0.0826737,0.0000000,NO,,1.7914960
SQFAFDDSVPSTPLSR,ph,T,870,true,"Col-0 X-ray callus - FC Col-0 vs. Col-0 Xray",111b,31410901,,37.0600000,,-0.0826737,0.0000000,NO,,1.7914960
SQFAFDDSVPSTPLSR,ph,T,870,true,"atm callus - FC atm vs. atm Xray",111c,31410901,,37.0600000,,0.4189346,0.0000000,NO,,1.7914960
SQFAFDDSVPSTPLSR,ph,T,870,true,"atm-3 X-ray callus - FC atm vs. atm Xray",111d,31410901,,37.0600000,,0.4189346,0.0000000,NO,,1.7914960
KSQFAFDDSVPSTPLSR,ph,S,873,true,"Tissue atlas Arabidopsis - ProteomicsDB",114,32188942,"MaxQuant score",96.5500000,0.9755480,,,,4.3351901695132E-6,
FGNSPPRFSDASAR,ph,S,878,true,"Arabidopsis root NAA phosphoproteome",18a,27643528,"MaxQuant Score",41.0880000,0.9350000,,,,0.0020000000949949,-0.2550000
FGNSPPRFSDASAR,ph,S,878,true,"STN8 phosphoproteome",38,21768351,"MASCOT Score",54.4200000,,,,,,-0.1828830
FGNSPPRFSDASAR,ph,S,878,true,"MAPK Arabidopsis substrates",45,23172892,"MaxQuant Score",94.7170000,,,,,,
FGNSPPRFSDASAR,ph,S,878,true,"Phosphoproteome ethylene-regulated time response",46,24043427,"MASCOT Score",71.0500000,,,,,,6.2692000
FGNSPPRFSDASAR,ph,S,878,true,"Chloroplast kinase substrates",60,19376835,"MASCOT Score",51.9000000,,,,,,0.7978140
FGNSPPRFSDASAR,ph,S,878,true,"srk2dei ABA signaling phopshoproteomics",83,23572148,"MASCOT Score",57.0000000,,,,,,0.0000000
FGNSPPRFSDASAR,ph,S,878,true,"atm and atr DNA damage response",88,25561503,"MASCOT Score",24.0000000,1.0000000,,,,,-0.2200000
FGNSPPRFSDASAR,ph,S,878,true,"TOR Kinase and ABA Receptor",100,29290610,XCorr,2.8656423,1.0000000,,,,0.020549999549985,
FGNSPPRFSDASAR,ph,S,878,true,"Tissue atlas Arabidopsis - ProteomicsDB",114,32188942,"MaxQuant score",166.7700000,1.0000000,,,,8.2797196228057E-6,
FGNSPPR,ph,S,878,true,"Phosphorylation Early Elicitor Signaling",23,17317660,,,,,,,,
FGNSPPR,ph,S,878,true,"STN8 phosphoproteome",38,21768351,"MASCOT Score",64.5500000,,,,,,-0.5604430
FGNSPPR,ph,S,878,true,"Chloroplast kinase substrates",60,19376835,"MASCOT Score",59.1300000,,,,,,-0.4669160
FGNSPPR,ph,S,878,true,"LAXIC - ABA stress",84a,23660473,XCorr,2.3800000,1.0000000,,,,0.17861500382423,
FGNSPPR,ph,S,878,true,"LAXIC - mannitol vs control",84b,23660473,XCorr,2.6800000,1.0000000,,,,0.0043359799310565,
FGNSPPR,ph,S,878,true,"SnRK2 protein kinase substrates",85,23776212,XCorr,2.4144907,1.0000000,,,,0.016417799517512,
FGNSPPR,ph,S,878,true,"TOR Kinase and ABA Receptor",100,29290610,XCorr,2.9011607,1.0000000,,,,0.0010890000266954,
FGNSPPR,ph,S,878,true,"Lateral root-induction - NAA vs control",106,23328941,"MASCOT Score",33.0000000,,,,,,
FGNSPPR,ph,S,878,true,"Phospho cell culture sucrose/TOR",109,30833711,,,1.0000000,,,,,
FGNSPPR,ph,S,878,true,"Col-0 callus - FC Col-0 vs. Col-0 Xray",111a,31410901,,43.2400000,,0.0825203,0.0000000,NO,,-0.2377869
FGNSPPR,ph,S,878,true,"Col-0 X-ray callus - FC Col-0 vs. Col-0 Xray",111b,31410901,,43.2400000,,0.0825203,0.0000000,NO,,-0.2377869
FGNSPPR,ph,S,878,true,"atm callus - FC atm vs. atm Xray",111c,31410901,,43.2400000,,-0.2879893,0.0000000,NO,,-0.2377869
FGNSPPR,ph,S,878,true,"atm-3 X-ray callus - FC atm vs. atm Xray",111d,31410901,,43.2400000,,-0.2879893,0.0000000,NO,,-0.2377869
FGNSPPRFSDASAR,ph,S,883,true,"srk2dei ABA signaling phopshoproteomics",83,23572148,"MASCOT Score",30.0000000,,,,,,0.0006000
FGNSPPRFSDASAR,ph,S,883,true,"atm and atr DNA damage response",88,25561503,"MASCOT Score",24.0000000,0.9910000,,,,,-0.2200000
FGNSPPRFSDASAR,ph,S,883,true,"TOR Kinase and ABA Receptor",100,29290610,XCorr,2.8656423,0.9998000,,,,0.020549999549985,
FGNSPPRFSDASAR,ph,S,883,true,"Col-0 callus - FC Col-0 vs. Col-0 Xray",111a,31410901,,36.7500000,,0.3558707,0.0000000,NO,,0.9245529
FGNSPPRFSDASAR,ph,S,883,true,"Col-0 X-ray callus - FC Col-0 vs. Col-0 Xray",111b,31410901,,36.7500000,,0.3558707,0.0000000,NO,,0.9245529
FGNSPPRFSDASAR,ph,S,883,true,"atm callus - FC atm vs. atm Xray",111c,31410901,,36.7500000,,0.9838168,0.0000000,NO,,0.9245529
FGNSPPRFSDASAR,ph,S,883,true,"atm-3 X-ray callus - FC atm vs. atm Xray",111d,31410901,,36.7500000,,0.9838168,0.0000000,NO,,0.9245529
FGNSPPRFSDASAR,ph,S,883,true,"Tissue atlas Arabidopsis - ProteomicsDB",114,32188942,"MaxQuant score",130.0500000,1.0000000,,,,2.175199915655E-5,
FGNSPPRFSDASAR,ph,S,886,true,"MAPK Arabidopsis substrates",45,23172892,"MaxQuant Score",65.0920000,,,,,,
FGNSPPRFSDASAR,ph,S,886,true,"Tissue atlas Arabidopsis - ProteomicsDB",114,32188942,"MaxQuant score",82.8000000,1.0000000,,,,0.00060190400108695,
DNNFDSFSRFDSFNTSEAGAGFSSQPER,ph,S,894,true,"MAPK Arabidopsis substrates",45,23172892,"MaxQuant Score",85.9820000,,,,,,
DNNFDSFSR,ph,S,894,true,"Tissue atlas Arabidopsis - ProteomicsDB",114,32188942,"MaxQuant score",156.5800000,0.9926050,,,,8.4612700447906E-5,
DNNFDSFSR,ph,S,896,true,"atm and atr DNA damage response",88,25561503,"MASCOT Score",53.0000000,0.9540000,,,,,-1.0200000
DNNFDSFSRFDSFNTSEAGAGFSSQPER,ph,S,900,true,"TOR Kinase and ABA Receptor",100,29290610,XCorr,5.2082124,0.8495000,,,,6.7830001171387E-7,
FDSFNTSEAGAGFSSQPER,ph,S,900,true,"Arabidopsis root NAA phosphoproteome",18a,27643528,"MaxQuant Score",94.0190000,1.0000000,,,,8.3159997985027E-12,-0.1670000
FDSFNTSEAGAGFSSQPER,ph,S,900,true,"Phosphorylation Early Elicitor Signaling",23,17317660,,,,,,,,
FDSFNTSEAGAGFSSQPER,ph,S,900,true,"srk2dei ABA signaling phopshoproteomics",83,23572148,"MASCOT Score",68.0000000,,,,,,-0.0004000
FDSFNTSEAGAGFSSQPER,ph,S,900,true,"LAXIC - mannitol vs control",84b,23660473,XCorr,4.9800000,1.0000000,,,,1.2900000078558E-14,
FDSFNTSEAGAGFSSQPER,ph,S,900,true,"SnRK2 protein kinase substrates",85,23776212,XCorr,4.6760697,1.0000000,,,,3.0825398425804E-5,
FDSFNTSEAGAGFSSQPER,ph,S,900,true,"atm and atr DNA damage response",88,25561503,"MASCOT Score",60.0000000,0.9440000,,,,,0.0200000
FDSFNTSEAGAGFSSQPER,ph,S,900,true,"TOR Kinase and ABA Receptor",100,29290610,XCorr,5.2803397,1.0000000,,,,2.7869999641439E-8,
FDSFNTSEAGAGFSSQPER,ph,S,900,true,"Lateral root-induction - NAA vs control",106,23328941,"MASCOT Score",65.0000000,,,,,,
FDSFNTSEAGAGFSSQPER,ph,S,900,true,"Phospho cell culture sucrose/TOR",109,30833711,,,0.9999990,,,,,
FDSFNTSEAGAGFSSQPER,ph,S,900,true,"Col-0 callus - FC Col-0 vs. Col-0 Xray",111a,31410901,,119.6400000,,1.1838753,0.0000000,NO,,1.4290125
FDSFNTSEAGAGFSSQPER,ph,S,900,true,"Col-0 X-ray callus - FC Col-0 vs. Col-0 Xray",111b,31410901,,119.6400000,,1.1838753,0.0000000,NO,,1.4290125
FDSFNTSEAGAGFSSQPER,ph,S,900,true,"atm callus - FC atm vs. atm Xray",111c,31410901,,119.6400000,,0.3713580,0.0000000,NO,,1.4290125
FDSFNTSEAGAGFSSQPER,ph,S,900,true,"atm-3 X-ray callus - FC atm vs. atm Xray",111d,31410901,,119.6400000,,0.3713580,0.0000000,NO,,1.4290125
FDSFNTSEAGAGFSSQPER,ph,S,900,true,"Tissue atlas Arabidopsis - ProteomicsDB",114,32188942,"MaxQuant score",388.4700000,1.0000000,,,,0,
FDSFNTSEAGAGFSSQPER,ph,T,903,true,"Lateral root-induction - NAA vs control",106,23328941,"MASCOT Score",46.0000000,,,,,,
FDSFNTSEAGAGFSSQPER,ph,T,903,true,"Tissue atlas Arabidopsis - ProteomicsDB",114,32188942,"MaxQuant score",290.5700000,0.9997620,,,,0,
FDSFNTSEAGAGFSSQPER,ph,S,912,true,"Tissue atlas Arabidopsis - ProteomicsDB",114,32188942,"MaxQuant score",285.1000000,0.8457360,,,,0,
LSRFDSINSSKDFGGAAFSR,ph,S,922,true,"MAPK Arabidopsis substrates",45,23172892,"MaxQuant Score",78.7080000,,,,,,
FDSINSSKDFGGAAFSR,ph,S,922,true,"STN8 phosphoproteome",38,21768351,"MASCOT Score",74.5300000,,,,,,-1.9452800
FDSINSSKDFGGAAFSR,ph,S,922,true,"MAPK Arabidopsis substrates",45,23172892,"MaxQuant Score",89.4680000,,,,,,
FDSINSSKDFGGAAFSR,ph,S,922,true,"SnRK2 protein kinase substrates",85,23776212,XCorr,4.0342951,0.9950000,,,,0.00025446800282225,
FDSINSSKDFGGAAFSR,ph,S,922,true,"atm and atr DNA damage response",88,25561503,"MASCOT Score",35.0000000,1.0000000,,,,,-0.1800000
FDSINSSKDFGGAAFSR,ph,S,922,true,"Col-0 callus - FC Col-0 vs. Col-0 Xray",111a,31410901,,52.8300000,,1.6600929,0.0103223,YES,,-1.8186183
FDSINSSKDFGGAAFSR,ph,S,922,true,"Col-0 X-ray callus - FC Col-0 vs. Col-0 Xray",111b,31410901,,52.8300000,,1.6600929,0.0103223,YES,,-1.8186183
FDSINSSKDFGGAAFSR,ph,S,922,true,"atm callus - FC atm vs. atm Xray",111c,31410901,,52.8300000,,0.9272944,0.3564175,NO,,-1.8186183
FDSINSSKDFGGAAFSR,ph,S,922,true,"atm-3 X-ray callus - FC atm vs. atm Xray",111d,31410901,,52.8300000,,0.9272944,0.3564175,NO,,-1.8186183
FDSINSSKDFGGAAFSR,ph,S,922,true,"Tissue atlas Arabidopsis - ProteomicsDB",114,32188942,"MaxQuant score",188.9100000,1.0000000,,,,3.5715200241704E-10,
LSRFDSINSSK,ph,S,922,true,"srk2dei ABA signaling phopshoproteomics",83,23572148,"MASCOT Score",31.0000000,,,,,,-0.0002000
LSRFDSINSSK,ph,S,922,true,"atm and atr DNA damage response",88,25561503,"MASCOT Score",31.0000000,1.0000000,,,,,-0.4500000
LSRFDSINSSK,ph,S,922,true,"TOR Kinase and ABA Receptor",100,29290610,XCorr,3.5088873,1.0000000,,,,0.021269999444485,
FDSINSSK,ph,S,922,true,"STN8 phosphoproteome",38,21768351,"MASCOT Score",56.9000000,,,,,,-0.2211580
FDSINSSK,ph,S,922,true,"Chloroplast kinase substrates",60,19376835,"MASCOT Score",53.6200000,,,,,,-0.2007170
FDSINSSK,ph,S,922,true,"LAXIC - mannitol vs control",84b,23660473,XCorr,2.3100000,0.9990000,,,,3.1100000342121E-5,
FDSINSSK,ph,S,922,true,"SnRK2 protein kinase substrates",85,23776212,XCorr,2.2703950,1.0000000,,,,0.0068842098116875,
FDSINSSK,ph,S,922,true,"atm and atr DNA damage response",88,25561503,"MASCOT Score",43.0000000,1.0000000,,,,,-1.1600000
FDSINSSK,ph,S,922,true,"Protein sumoylation and phosphorylation cross-talk",97,28419593,,,,,,,,