Peptide,PTM,ModifiedAA,ModifiedPosition,PeptideUniqueToGene,ExperimentDesc,ExpID,PubmedID,ScoreType,IdentScore,LocProb,Log2FChange,PQ-val,QuantSig,PEP,MassErrorPPM
VRPSSAHDSPFFTTNSGAPVWNNNSSLTVGTR,ph,S,10,true,"Tissue atlas Arabidopsis - ProteomicsDB",114,32188942,"MaxQuant score",211.6700000,0.8324210,,,,0,
GPGVQTPVIVR,nt,G,92,true,"Stromal N-terminome",96,26371235,"MASCOT Score",42.7300000,,,,,,
GFAVKFYTR,ac,K,125,false,"Histone deacetylases - apicidin vs control",98a,29061669,"MaxQuant Score",119.5000000,1.0000000,0.0140000,0.9462372,NO,0.0070000002160668,
LFDDLGIPQDYR,nta,L,189,true,"FtsH12 N-terminome: WT / FtsH12 knockdown miRNA",118,33216923,"MaxQuant score",78.2640000,,,,,0.034497998654842,
DDLGIPQDYR,nt,D,191,true,"Arg/N-end rule seed, prt6 vs. Wt",99,29168982,"MASCOT Score",31.5800000,,-0.8061748,0.2305939,NO,0.094959996640682,-0.4626801
FHWKPTCGIK,sno,C,230,false,"Site-specific nitrosomeproteomic id - gsnor1-3",90a,25699590,XCorr,2.3376994,,,,,0.0031640001107007,-6.3519930
FHWKPTCGIK,sno,C,230,false,"Site-specific nitrosomeproteomic id - gsnor1-3",90b,25699590,XCorr,2.4600000,,,,,0.089210003614426,-6.7200000
CLSDEEAIR,so,C,234,true,"S-sulfenylation site detection using YAP1C",110,32714340,,,,,,,,
YPTTPIVCSGNR,ph,T,409,true,"Tyrosine phosphorylation in Arabidopsis",59,18463617,"MASCOT Score",32.0000000,,,,,,-1.1083249
YPTTPIVCSGNR,ph,T,409,true,"Tissue atlas Arabidopsis - ProteomicsDB",114,32188942,"MaxQuant score",166.7000000,0.9997840,,,,4.0666898830626E-14,
HAEKYPTTPIVCSGNR,sno,C,413,true,"Site-specific nitrosomeproteomic id - gsnor1-3",90b,25699590,XCorr,2.1800000,,,,,0.047230001538992,-7.2900000
YPTTPIVCSGNR,sno,C,413,true,"Site-specific nitrosomeproteomic id - gsnor1-3",90a,25699590,XCorr,2.6635985,,,,,0.0017310000257567,-6.2094877
YPTTPIVCSGNR,sno,C,413,true,"Site-specific nitrosomeproteomic id - gsnor1-3",90b,25699590,XCorr,2.5500000,,,,,0.13580000400543,-7.1800000
