Peptide,PTM,ModifiedAA,ModifiedPosition,PeptideUniqueToGene,ExperimentDesc,ExpID,PubmedID,ScoreType,IdentScore,LocProb,Log2FChange,PQ-val,QuantSig,PEP,MassErrorPPM
MDPYKYRPSSAYNAPFYTTNGGAPVSNNISSLTIGER,nta,M,1,true,"Stromal N-terminome",96,26371235,"MASCOT Score",55.3000000,,,,,,
MDPYKYRPSSAYNAPFYTTNGGAPVSNNISSLTIGER,nta,M,1,true,"HUNTER N-terminome: legumain, GluC and trypsin",119,31951383,"MaxQuant score",75.7590000,,,,,,
MDPYKYRPSSAYN,nta,M,1,true,"HUNTER N-terminome: legumain, GluC and trypsin",119,31951383,"MaxQuant score",107.7900000,,,,,,
MDPYKYRPSS,nta,M,1,true,"N-term acetylation drought responses",5,26184543,,,,,,,,
YRPSSAYNAPFYTTNGGAPVSNNISSLTIGER,ph,Y,12,true,"Tissue atlas Arabidopsis - ProteomicsDB",114,32188942,"MaxQuant score",86.1450000,0.8384790,,,,1.9863799424563E-17,
TNGGAPVSNNISSLTIGE,nt,T,19,true,"Arg/N-end rule seed, prt6 vs. Wt",99,29168982,"MASCOT Score",42.3200000,,-0.0740247,0.9095904,NO,2.7909999289477E-7,-1.2846511
GGAPVSNNISSLTIGER,nt,G,21,true,"FtsH12 N-terminome: WT / FtsH12 knockdown miRNA",118,33216923,"MaxQuant score",180.6100000,,,,,0,
GGAPVSNNISSLTIGE,nt,G,21,true,"N-terminal ChaFRADIC",92,26010716,"MASCOT Score",39.9500000,,,,,1.7349999552607E-6,
GGAPVSNNISSLTIGE,nt,G,21,true,"Arg/N-end rule seed, prt6 vs. Wt",99,29168982,"MASCOT Score",64.4800000,,-0.3985110,0.3677988,NO,1.6920000689424E-7,-4.2841752
NISSLTIGER,nt,N,28,true,"Arg/N-end rule seed, prt6 vs. Wt",99,29168982,"MASCOT Score",40.1200000,,-0.0243445,0.9711875,NO,0.14880000054836,-1.5979088
NISSLTIGE,nt,N,28,true,"Arg/N-end rule seed, prt6 vs. Wt",99,29168982,"MASCOT Score",55.5500000,,-1.4369877,0.1961540,NO,0.00064370001200587,-0.0553675
SLTIGER,nt,S,31,true,"Arg/N-end rule seed, prt6 vs. Wt",99,29168982,"MASCOT Score",26.5200000,,-1.1890199,0.1839315,NO,0.21140000224113,-0.2586537
GPVLLEDYHLIEKVANFTR,ac,K,50,true,"Histone deacetylases - apicidin vs control",98a,29061669,"MaxQuant Score",183.7000000,1.0000000,0.0100000,0.9727472,NO,0,
GPVLLEDYHLIEKVANFTR,ac,K,50,true,"Histone deacetylases substrates - TSA vs control",98b,29061669,"MaxQuant Score",183.7000000,1.0000000,-0.4800000,0.6622165,NO,0,
GPVLLEDYHLIEK,ac,K,50,true,"Quantitative Acetylproteomics",101,29440448,,,,,,,,
HDISNLTCADFLR,nta,H,79,false,"FtsH12 N-terminome: WT / FtsH12 knockdown miRNA",118,33216923,"MaxQuant score",67.8460000,,,,,1.0300000212737E-5,
GFFEVTHDISNLTCADFLR,ph,T,85,false,"Phosphorylation in N starvation",63,22060019,"MASCOT Score",24.0000000,,,,,,0.2076850
GFFEVTHDISNLTCADFLR,sno,C,86,false,"Cold stress nitrosylation - 4°C vs 22°C",65,24388526,,,,,,,,
GFFEVTHDISNLTCADFLR,sno,C,86,false,"Site-specific nitrosomeproteomic id - gsnor1-3",90a,25699590,XCorr,4.7600000,,,,,0.0066929999738932,-4.1400000
GFFEVTHDISNLTCADFLR,sno,C,86,false,"Site-specific nitrosomeproteomic id - gsnor1-3",90b,25699590,XCorr,5.1100000,,,,,0.00088920001871884,-3.3700000
APGVQTPVIVR,nt,A,92,false,"Arg/N-end rule seed, prt6 vs. Wt",99,29168982,"MASCOT Score",35.6900000,,,,,0.074600003659725,-0.8013589
GFAVKFYTR,ac,K,125,false,"Histone deacetylases - apicidin vs control",98a,29061669,"MaxQuant Score",119.5000000,1.0000000,0.0140000,0.9462372,NO,0.0070000002160668,
WMFDDVGIPQDYR,nt,W,188,true,"Arg/N-end rule seed, prt6 vs. Wt",99,29168982,"MASCOT Score",31.3100000,,0.1027556,0.8033029,NO,0.07575000077486,-1.3279304
DDVGIPQDYR,nt,D,191,true,"FtsH12 N-terminome: WT / FtsH12 knockdown miRNA",118,33216923,"MaxQuant score",209.9000000,,,,,0,
SGKVLFVKFHWKPTCGIK,sno,C,230,true,"Site-specific nitrosomeproteomic id - gsnor1-3",90a,25699590,XCorr,2.9781730,,,,,0.00057079998077825,-4.1292280
SGKVLFVKFHWKPTCGIK,sno,C,230,true,"Site-specific nitrosomeproteomic id - gsnor1-3",90b,25699590,XCorr,3.2000000,,,,,0.00041539999074303,-7.0500000
VLFVKFHWKPTCGIK,sno,C,230,true,"Site-specific nitrosomeproteomic id - gsnor1-3",90b,25699590,XCorr,2.3600000,,,,,0.00093129999004304,-6.5600000
FHWKPTCGIK,sno,C,230,false,"Site-specific nitrosomeproteomic id - gsnor1-3",90a,25699590,XCorr,2.3376994,,,,,0.0031640001107007,-6.3519930
FHWKPTCGIK,sno,C,230,false,"Site-specific nitrosomeproteomic id - gsnor1-3",90b,25699590,XCorr,2.4600000,,,,,0.089210003614426,-6.7200000
DAIASGNYPE,nt,D,257,true,"Arg/N-end rule seed, prt6 vs. Wt",99,29168982,"MASCOT Score",39.1900000,,-0.7468711,0.1250584,NO,0.0037420000880957,0.0870079
AIASGNYPE,nt,A,258,true,"N-terminal ChaFRADIC",92,26010716,"MASCOT Score",62.2900000,,,,,0.0036410000175238,
IFAYGDTQR,nt,I,345,true,"Arg/N-end rule seed, prt6 vs. Wt",99,29168982,"MASCOT Score",51.6600000,,,,,0.039140000939369,-0.2008624
IFAYGDTQR,nta,I,345,true,"Arg/N-end rule seed, prt6 vs. Wt",99,29168982,"MASCOT Score",51.6600000,,,,,0.039140000939369,-0.2008624
CAHHNNHHEGFMNFMHR,sno,C,370,false,"Site-specific nitrosomeproteomic id - gsnor1-3",90b,25699590,XCorr,2.3400000,,,,,9.9389999377308E-6,-6.2700000
DEEINYYPSKFDPVR,ac,K,396,true,"Histone deacetylases - apicidin vs control",98a,29061669,"MaxQuant Score",95.2000000,1.0000000,-0.3190000,0.1807174,NO,9.2999998742016E-6,
DEEINYYPSKFDPVR,ac,K,396,true,"Histone deacetylases substrates - hda14 vs WT",98e,29061669,"MaxQuant Score",71.1000000,1.0000000,-0.0200000,0.9772372,NO,2.9000000267843E-6,
DEEINYYPSKFDPVR,ac,K,396,true,"Quantitative Acetylproteomics",101,29440448,,,,,,,,
DEEINYYPSKFDPVR,ub,K,396,true,"upl3 mutant / wildtype",168,35926874,"MaxQuant score",52.5270000,1.0000000,-1.5649048,,,0.00093621300766245,1.3521000
CAEKVPTPTNSYTGIR,ox,C,402,true,"SPEAR - 10 mM H2O2 / mock",138a,34619326,,,,3.2974043,0.0136920,YES,,
CAEKVPTPTNSYTGIR,ox,C,402,true,"SPEAR - 50 mM H2O2 / mock",138b,34619326,,,,2.2876437,0.0126061,YES,,
CAEKVPTPTNSYTGIR,sno,C,402,true,"Site-specific nitrosomeproteomic id - gsnor1-3",90a,25699590,XCorr,3.8927689,,,,,1.0329999895475E-5,-5.5300476
CAEKVPTPTNSYTGIR,sno,C,402,true,"Site-specific nitrosomeproteomic id - gsnor1-3",90b,25699590,XCorr,3.8164017,,,,,0.016589999198914,-5.7035625
AEKVPTPTNSYTGIR,nt,A,403,true,"Arg/N-end rule seed, prt6 vs. Wt",99,29168982,"MASCOT Score",23.5100000,,-0.3161816,0.1046717,NO,0.010289999656379,2.0697026
CAEKVPTPTNSYTGIR,ph,T,408,true,"PAMP-triggered phosphorylation",48,24601666,"MASCOT Score",39.7000000,,,,,,
CAEKVPTPTNSYTGIR,ph,T,408,true,"SnRK2 protein kinase substrates",85,23776212,XCorr,2.2587547,0.9980000,,,,0.00071617402136326,
VPTPTNSYTGIR,ph,T,408,true,"Chloroplast kinase substrates",60,19376835,"MASCOT Score",38.7000000,,,,,,-0.6536470
VPTPTNSYTGIR,ph,T,408,true,"srk2dei ABA signaling phopshoproteomics",83,23572148,"MASCOT Score",35.0000000,,,,,,0.0004000
VPTPTNSYTGIR,ph,T,408,true,"atm and atr DNA damage response",88,25561503,"MASCOT Score",35.0000000,1.0000000,,,,,0.1100000
VPTPTNSYTGIR,ph,T,408,true,"TOR Kinase and ABA Receptor",100,29290610,XCorr,2.8640172,1.0000000,,,,0.00047349999658763,
VPTPTNSYTGIR,ph,T,408,true,"Tissue atlas Arabidopsis - ProteomicsDB",114,32188942,"MaxQuant score",229.4800000,1.0000000,,,,0,
CAEKVPTPTNSYTGIR,ph,T,410,true,"PAMP-triggered phosphorylation",48,24601666,"MASCOT Score",26.4400000,,,,,,
VPTPTNSYTGIR,ph,T,410,true,"srk2dei ABA signaling phopshoproteomics",83,23572148,"MASCOT Score",25.0000000,,,,,,-0.0002000
VPTPTNSYTGIR,ph,S,412,true,"atm and atr DNA damage response",88,25561503,"MASCOT Score",22.0000000,0.9900000,,,,,1.4500000
VPTPTNSYTGIR,ph,S,412,true,"Tissue atlas Arabidopsis - ProteomicsDB",114,32188942,"MaxQuant score",126.1000000,0.9890310,,,,3.3789499866543E-5,
SWAPDR,nt,S,437,true,"N-terminal ChaFRADIC",92,26010716,"MASCOT Score",27.2900000,,,,,0.17360000312328,
SLGQKLASR,ac,K,481,false,"Histone deacetylases - apicidin vs control",98a,29061669,"MaxQuant Score",99.8000000,1.0000000,-0.1250000,0.4677351,NO,0.0040000001899898,
LASRLNVRPSI,ph,S,484,false,"Tissue atlas Arabidopsis - ProteomicsDB",114,32188942,"MaxQuant score",71.5060000,0.9999930,,,,0.0070018600672483,
LNVRPSI,ph,S,491,false,"srk2dei ABA signaling phopshoproteomics",83,23572148,"MASCOT Score",32.0000000,,,,,,0.0000000
LNVRPSI,ph,S,491,false,"TOR Kinase and ABA Receptor",100,29290610,XCorr,2.9836392,1.0000000,,,,0.0011690000537783,
