Peptide,PTM,ModifiedAA,ModifiedPosition,PeptideUniqueToGene,ExperimentDesc,ExpID,PubmedID,ScoreType,IdentScore,LocProb,Log2FChange,PQ-val,QuantSig,PEP,MassErrorPPM
IEVLLGGGDGSLAFIPNDFSIAKGE,nt,I,69,true,"N-terminal ChaFRADIC",92,26010716,"MASCOT Score",69.2300000,,,,,3.2559999835202E-11,
IEVLLGGGDGSLAFIPNDFSIAKGE,nt,I,69,true,"HUNTER N-terminome: legumain, GluC and trypsin",119,31951383,"MaxQuant score",56.6250000,,,,,,
IEVLLGGGDGSLAFIPN,nt,I,69,true,"HUNTER N-terminome: legumain, GluC and trypsin",119,31951383,"MaxQuant score",111.6300000,,,,,,
IEVLLGGGDGSLAFIPN,nt,I,69,true,"Arabidopsis translation initiation landscape - NT",167b,35069635,,,,,,,,
IEVLLGGGD,nt,I,69,true,"HUNTER N-terminome: legumain, GluC and trypsin",119,31951383,"MaxQuant score",129.6800000,,,,,,
DFSIAKGE,nt,D,86,true,"Arg/N-end rule seed, prt6 vs. Wt",99,29168982,"MASCOT Score",30.8100000,,-0.7390114,0.0250248,NO,0.00018709999858402,-1.5249097
GEKIVFK,ac,K,94,false,"Histone deacetylases substrates - hda14 vs WT",98e,29061669,"MaxQuant Score",103.7000000,1.0000000,0.0250000,0.9772372,NO,0.0010000000474975,
GEKIVFK,ac,K,94,false,"Quantitative Acetylproteomics",101,29440448,,,,,,,,
IVFKNNAGYPHNVVFDEDEIPSGVDVAK,ac,K,98,true,"Quantitative Acetylproteomics",101,29440448,,,,,,,,
