Peptide,PTM,ModifiedAA,ModifiedPosition,PeptideUniqueToGene,ExperimentDesc,ExpID,PubmedID,ScoreType,IdentScore,LocProb,Log2FChange,PQ-val,QuantSig,PEP,MassErrorPPM
AETKKMIILKSS,nta,A,2,false,"Arabidopsis translation initiation landscape - NTA",167a,35069635,,,,,,,,
HMIEDDCADNGIPLPNVTGAILAK,so,C,39,true,"S-sulfenylation site detection using YAP1C",110,32714340,,,,,,,,
ILAKVIEYCK,ub,K,56,false,"upl3 mutant / wildtype",168,35926874,"MaxQuant score",82.2610000,1.0000000,1.1375035,0.2419800,NO,0.0014682000037283,-0.6071100
VIEYCK,sno,C,61,false,"hot5-4 / wildtype, FAT-switch S-nitrosoproteome",169,37277371,,,,,,,,
VIEYCKK,so,C,61,false,"S-sulfenylation site detection using YAP1C",110,32714340,,,,,,,,
VIEYCK,so,C,61,false,"Arabidopsis S-sulfenylation chemoproteomics",108,31578252,"pFind PSM Score",0.2962380,,,,,,0.7726998
VIEYCKK,me2,K,62,false,"Arabidopsis protein methylome",123,31809900,"MaxQuant Score",62.7140000,1.0000000,,,,0.0094729904085398,0.7532300
GKTPEQMR,ub,K,131,true,"Arabidopsis ubiquitination COFRADIC",40,26744219,"MaxQuant Score",44.3490000,1.0000000,,,,0.032000001519918,0.0440000
AHFNIKNDYTPEEEAEVR,ac,K,143,true,"Quantitative Acetylproteomics",101,29440448,,,,,,,,
