Peptide,PTM,ModifiedAA,ModifiedPosition,PeptideUniqueToGene,ExperimentDesc,ExpID,PubmedID,ScoreType,IdentScore,LocProb,Log2FChange,PQ-val,QuantSig,PEP,MassErrorPPM
FDQSGYDGYNRSR,ph,S,216,true,"Tissue atlas Arabidopsis - ProteomicsDB",114,32188942,"MaxQuant score",135.0800000,0.9992620,,,,1.3915700037614E-5,
SRSDLGSDLYGK,ph,S,216,true,"Phosphoproteome iron-deficient Arabidopsis roots",41,22438062,"MASCOT Score",45.6600000,,,,,,
SRSDLGSDLYGK,ph,S,216,true,"srk2dei ABA signaling phopshoproteomics",83,23572148,"MASCOT Score",41.0000000,,,,,,0.0000000
SRSDLGSDLYGKR,ph,S,218,true,"SnRK2 protein kinase substrates",85,23776212,XCorr,4.5778766,0.9600000,,,,1.1446300157703E-10,
SRSDLGSDLYGKR,ph,S,218,true,"Protein sumoylation and phosphorylation cross-talk",97,28419593,,,,,,,,
SRSDLGSDLYGK,ph,S,218,true,"Arabidopsis root NAA phosphoproteome",18a,27643528,"MaxQuant Score",77.7460000,0.9680000,,,,2.1240000478429E-6,-0.0680000
SRSDLGSDLYGK,ph,S,218,true,"Phosphorylation nuclei-enriched fractions",28,19245862,,,,,,,,
SRSDLGSDLYGK,ph,S,218,true,"STN8 phosphoproteome",38,21768351,"MASCOT Score",44.6000000,,,,,,-0.1736400
SRSDLGSDLYGK,ph,S,218,true,"Phosphoproteome iron-deficient Arabidopsis roots",41,22438062,"MASCOT Score",60.9400000,,,,,,
SRSDLGSDLYGK,ph,S,218,true,"Tyrosine phosphorylation in Arabidopsis",59,18463617,"MASCOT Score",77.0000000,,,,,,-0.9443584
SRSDLGSDLYGK,ph,S,218,true,"Chloroplast kinase substrates",60,19376835,"MASCOT Score",40.8200000,,,,,,-0.3622360
SRSDLGSDLYGK,ph,S,218,true,"srk2dei ABA signaling phopshoproteomics",83,23572148,"MASCOT Score",76.0000000,,,,,,-0.0003000
SRSDLGSDLYGK,ph,S,218,true,"LAXIC - ABA stress",84a,23660473,XCorr,4.4700000,0.9980000,,,,0.0018945400370285,
SRSDLGSDLYGK,ph,S,218,true,"LAXIC - mannitol vs control",84b,23660473,XCorr,4.7000000,0.9990000,-1.5871655,,NO,8.9999998564849E-9,
SRSDLGSDLYGK,ph,S,218,true,"SnRK2 protein kinase substrates",85,23776212,XCorr,3.9762664,0.9990000,,,,0.033804900944233,
SRSDLGSDLYGK,ph,S,218,true,"atm and atr DNA damage response",88,25561503,"MASCOT Score",53.0000000,0.9980000,,,,,0.5300000
SRSDLGSDLYGK,ph,S,218,true,"Brassinosteroid-Regulated Phosphorylation Dynamics",94,26187819,"MaxQuant Score",176.2500000,1.0000000,,,,1.24100002928E-21,2.0300000
SRSDLGSDLYGK,ph,S,218,true,"TOR Kinase and ABA Receptor",100,29290610,XCorr,4.7478418,0.9928000,,,,0.00011609999637585,
SRSDLGSDLYGK,ph,S,218,true,"Phospho cell culture sucrose/TOR",109,30833711,,,0.9993530,,,,,
SRSDLGSDLYGK,ph,S,218,true,"Col-0 callus - FC Col-0 vs. Col-0 Xray",111a,31410901,,52.8800000,,1.0686497,0.0000000,NO,,0.3031317
SRSDLGSDLYGK,ph,S,218,true,"Col-0 X-ray callus - FC Col-0 vs. Col-0 Xray",111b,31410901,,52.8800000,,1.0686497,0.0000000,NO,,0.3031317
SRSDLGSDLYGK,ph,S,218,true,"atm callus - FC atm vs. atm Xray",111c,31410901,,52.8800000,,0.0010515,0.0000000,NO,,0.3031317
SRSDLGSDLYGK,ph,S,218,true,"atm-3 X-ray callus - FC atm vs. atm Xray",111d,31410901,,52.8800000,,0.0010515,0.0000000,NO,,0.3031317
SDLGSDLYGKR,ph,S,218,true,"STN8 phosphoproteome",38,21768351,"MASCOT Score",43.6700000,,,,,,-0.6560820
SDLGSDLYGKR,ph,S,218,true,"Tissue atlas Arabidopsis - ProteomicsDB",114,32188942,"MaxQuant score",220.2500000,1.0000000,,,,5.8545002683858E-39,
SDLGSDLYGK,ph,S,218,true,"Chloroplast kinase substrates",60,19376835,"MASCOT Score",61.1400000,,,,,,0.0366520
SDLGSDLYGKR,ph,S,222,true,"Tissue atlas Arabidopsis - ProteomicsDB",114,32188942,"MaxQuant score",76.2550000,0.9998530,,,,0.0013555199839175,
SDLGSDLYGK,ph,S,222,true,"atm and atr DNA damage response",88,25561503,"MASCOT Score",24.0000000,0.9980000,,,,,-1.9300000
SDLGSDLYGKR,ub,K,227,true,"Arabidopsis ubiquitination COFRADIC",40,26744219,"MaxQuant Score",114.8900000,1.0000000,,,,7.5650001818417E-9,-0.2940000
RSDSGEYPAFEDSYGDGVYAYQGGK,ph,S,231,true,"srk2dei ABA signaling phopshoproteomics",83,23572148,"MASCOT Score",39.0000000,,,,,,0.0026000
RSDSGEYPAFEDSYGDGVYAYQGGK,ph,S,231,true,"Brassinosteroid-Regulated Phosphorylation Dynamics",94,26187819,"MaxQuant Score",171.3900000,0.8010000,,,,2.5210000290495E-23,-0.9740000
RSDSGEYPAFEDSYGDGVYAYQGGK,ph,S,231,true,"TOR Kinase and ABA Receptor",100,29290610,XCorr,5.0120950,0.8113000,,,,5.7800002650765E-7,
GTAPKSSNSTLFDDYGR,ac,K,264,true,"Quantitative Acetylproteomics",101,29440448,,,,,,,,
SSNSTLFDDYGR,ph,S,266,true,"atm and atr DNA damage response",88,25561503,"MASCOT Score",61.0000000,0.9940000,,,,,0.2900000
SSNSTLFDDYGR,ph,S,268,true,"Tissue atlas Arabidopsis - ProteomicsDB",114,32188942,"MaxQuant score",192.1400000,0.9988510,,,,2.6693800715992E-24,
SISFSSSGR,ph,S,279,true,"Arabidopsis root NAA phosphoproteome",18a,27643528,"MaxQuant Score",42.6290000,0.9730000,,,,0.003000000026077,0.2490000
SISFSSSGR,ph,S,279,true,"STN8 phosphoproteome",38,21768351,"MASCOT Score",45.8900000,,,,,,-0.2760560
SISFSSSGR,ph,S,279,true,"Pollen phosphoproteome Arabidopsis",43,22631563,"MASCOT Score",48.0100000,,,,,,
SISFSSSGR,ph,S,279,true,"srk2dei ABA signaling phopshoproteomics",83,23572148,"MASCOT Score",49.0000000,,,,,,-0.0003000
SISFSSSGR,ph,S,279,true,"LAXIC - ABA stress",84a,23660473,XCorr,2.3100000,0.9460000,,,,0.0011513100471348,
SISFSSSGR,ph,S,279,true,"LAXIC - mannitol vs control",84b,23660473,XCorr,2.3300000,0.8970000,-1.0731609,,NO,0.0073578599840403,
SISFSSSGR,ph,S,279,true,"SnRK2 protein kinase substrates",85,23776212,XCorr,2.3281808,0.9550000,,,,0.013084700331092,
SISFSSSGR,ph,S,279,true,"atm and atr DNA damage response",88,25561503,"MASCOT Score",52.0000000,0.9950000,,,,,-0.4700000
SISFSSSGR,ph,S,279,true,"Protein sumoylation and phosphorylation cross-talk",97,28419593,,,,,,,,
SISFSSSGR,ph,S,279,true,"TOR Kinase and ABA Receptor",100,29290610,XCorr,2.4302719,0.9138000,,,,0.09876000136137,
SISFSSSGR,ph,S,279,true,"Phospho cell culture sucrose/TOR",109,30833711,,,0.9998370,,,,,
SISFSSSGR,ph,S,279,true,"Col-0 callus - FC Col-0 vs. Col-0 Xray",111a,31410901,,41.4400000,,-0.2811444,0.0000000,NO,,-0.1022861
SISFSSSGR,ph,S,279,true,"Col-0 X-ray callus - FC Col-0 vs. Col-0 Xray",111b,31410901,,41.4400000,,-0.2811444,0.0000000,NO,,-0.1022861
SISFSSSGR,ph,S,279,true,"atm callus - FC atm vs. atm Xray",111c,31410901,,41.4400000,,-1.8408410,0.0000000,NO,,-0.1022861
SISFSSSGR,ph,S,279,true,"atm-3 X-ray callus - FC atm vs. atm Xray",111d,31410901,,41.4400000,,-1.8408410,0.0000000,NO,,-0.1022861
SISFSSSGR,ph,S,279,true,"Tissue atlas Arabidopsis - ProteomicsDB",114,32188942,"MaxQuant score",157.2400000,0.9999980,,,,8.5571999079548E-5,
SISFSSSGR,fuc,S,281,true,"SPINDLY O-fucosylation",162,36739885,,,,,,,0.77999997138977,
SISFSSSGR,ph,S,281,true,"atm and atr DNA damage response",88,25561503,"MASCOT Score",31.0000000,0.9930000,,,,,-0.8600000
SISFSSSGR,ph,S,281,true,"Tissue atlas Arabidopsis - ProteomicsDB",114,32188942,"MaxQuant score",108.4300000,0.9482770,,,,0.00056523201055825,
SISFSSSGRDSSVSSNSAK,fuc,S,283,true,"SPINDLY O-fucosylation",162,36739885,,,,,,,-0.80000001192093,
SISFSSSGRDSSVSSNSAK,ph,S,287,true,"Tissue atlas Arabidopsis - ProteomicsDB",114,32188942,"MaxQuant score",88.2820000,0.8994440,,,,3.7538698961725E-5,
DSSVSSNSAKIVR,ub,K,295,true,"Arabidopsis ubiquitination COFRADIC",40,26744219,"MaxQuant Score",165.3500000,1.0000000,,,,0,2.4530000
AVPKADVQEDSTGGVQKFR,ub,K,302,true,"Arabidopsis ubiquitination COFRADIC",40,26744219,"MaxQuant Score",48.2880000,1.0000000,,,,7.2180000643129E-7,0.0220000
ADVQEDSTGGVQK,ph,S,309,true,"Tissue atlas Arabidopsis - ProteomicsDB",114,32188942,"MaxQuant score",99.9410000,0.8202640,,,,0.00022018600429874,
AVPKADVQEDSTGGVQKFR,ub,K,315,true,"Arabidopsis ubiquitination COFRADIC",40,26744219,"MaxQuant Score",105.9000000,1.0000000,,,,4.9869999165084E-26,-0.0130000
EIGGSSRPPTSGK,ph,S,421,true,"Tissue atlas Arabidopsis - ProteomicsDB",114,32188942,"MaxQuant score",170.7400000,0.9527670,,,,8.2257199099031E-15,
EIGGSSRPPTSGKLIEQTAEK,ub,K,423,true,"upl3 mutant / wildtype",168,35926874,"MaxQuant score",135.2100000,1.0000000,1.0538064,0.0909450,NO,2.9883599226143E-20,-0.1858500
CMAEVSQRLSNAK,ph,S,519,true,"Tissue atlas Arabidopsis - ProteomicsDB",114,32188942,"MaxQuant score",119.8700000,0.9997320,,,,0.0001050619976013,
NVSLQSHEDLAR,ph,S,530,true,"Phosphorylation nuclei-enriched fractions",28,19245862,,,,,,,,
NVSLQSHEDLAR,ph,S,530,true,"STN8 phosphoproteome",38,21768351,"MASCOT Score",56.4900000,,,,,,-0.8659840
NVSLQSHEDLAR,ph,S,530,true,"Large-scale phosphorylation discovery",44,23111157,XCorr,2.5500000,,,,,,
NVSLQSHEDLAR,ph,S,530,true,"srk2dei ABA signaling phopshoproteomics",83,23572148,"MASCOT Score",44.0000000,,,,,,0.0001000
NVSLQSHEDLAR,ph,S,530,true,"LAXIC - mannitol vs control",84b,23660473,XCorr,3.4800000,1.0000000,,,,0.0010265200398862,
NVSLQSHEDLAR,ph,S,530,true,"atm and atr DNA damage response",88,25561503,"MASCOT Score",86.0000000,0.9420000,,,,,0.0700000
NVSLQSHEDLAR,ph,S,530,true,"Phospho cell culture sucrose/TOR",109,30833711,,,1.0000000,,,,,
NVSLQSHEDLAR,ph,S,530,true,"Tissue atlas Arabidopsis - ProteomicsDB",114,32188942,"MaxQuant score",192.4600000,1.0000000,,,,2.5785299193733E-24,
NVSLQSHEDLAR,ph,S,530,true,"Touch-induced phosphorylation: 40s touch vs untouc",136,30291188,"MASCOT score",82.7200000,,0.3519579,0.3356743,NO,,6.4438720
NVSLQSHEDLAR,ph,S,533,true,"STN8 phosphoproteome",38,21768351,"MASCOT Score",73.3900000,,,,,,-1.5144100
NVSLQSHEDLAR,ph,S,533,true,"LAXIC - mannitol vs control",84b,23660473,XCorr,3.4800000,1.0000000,,,,0.0010265200398862,
NVSLQSHEDLAR,ph,S,533,true,"atm and atr DNA damage response",88,25561503,"MASCOT Score",73.0000000,1.0000000,,,,,0.0700000
NVSLQSHEDLAR,ph,S,533,true,"Protein sumoylation and phosphorylation cross-talk",97,28419593,,,,,,,,
NVSLQSHEDLAR,ph,S,533,true,"Lateral root-induction - NAA vs control",106,23328941,"MASCOT Score",65.0000000,,,,,,
NVSLQSHEDLAR,ph,S,533,true,"Phospho cell culture sucrose/TOR",109,30833711,,,0.9999930,,,,,
NVSLQSHEDLAR,ph,S,533,true,"Tissue atlas Arabidopsis - ProteomicsDB",114,32188942,"MaxQuant score",210.0800000,1.0000000,,,,3.363840008395E-31,
KLQEEMER,ub,K,540,true,"Arabidopsis ubiquitination COFRADIC",40,26744219,"MaxQuant Score",109.7100000,1.0000000,,,,0.0020000000949949,0.1290000
