Peptide,PTM,ModifiedAA,ModifiedPosition,PeptideUniqueToGene,ExperimentDesc,ExpID,PubmedID,ScoreType,IdentScore,LocProb,Log2FChange,PQ-val,QuantSig,PEP,MassErrorPPM
AQITTETDTPTPAK,nta,A,56,true,"Characterization plant N-terminal acetylation",6,22223895,"MASCOT Score",83.5000000,,,,,,
QITTETDTPTPAK,nt,Q,57,true,"Stromal N-terminome",96,26371235,"MASCOT Score",61.2100000,,,,,,
QITTETDTPTPA,nt,Q,57,true,"N-terminal ChaFRADIC",92,26010716,"MASCOT Score",67.1500000,,,,,1.4510000255541E-5,
QITTETDTPTPAK,nta,Q,57,true,"Characterization plant N-terminal acetylation",6,22223895,"MASCOT Score",82.8200000,,,,,,
QITTETDTPTPAK,nta,Q,57,true,"Stromal N-terminome",96,26371235,"MASCOT Score",61.2100000,,,,,,
KVEKVSK,ac,K,73,true,"Quantitative Acetylproteomics",101,29440448,,,,,,,,
KNEEGVIVNR,cr,K,77,true,"Open search Plant PTM Viewer 2.0 - Crotonylation",164c,TBA,,,,,,,,
NEEGVIVNRYR,ph,Y,87,true,"atm and atr DNA damage response",88,25561503,"MASCOT Score",24.0000000,1.0000000,,,,,-0.1600000
YRPKEPYTGK,ac,K,90,true,"Histone deacetylases- hda14 vs WT (low light)",98c,29061669,"MaxQuant Score",116.8400000,1.0000000,0.2850000,0.9885531,NO,0.00023000000510365,
YRPKEPYTGK,ac,K,90,true,"Histone deacetylases - hda14 vs WT (thylakoids)",98d,29061669,"MaxQuant Score",75.8000000,1.0000000,0.4140000,0.8394600,NO,0.0010000000474975,
CLLNTK,sno,C,97,false,"Cold stress nitrosylation - 4°C vs 22°C",65,24388526,,,,,,,,
CLLNTK,so,C,97,false,"S-sulfenylation site detection using YAP1C",110,32714340,,,,,,,,
SHQGEIPYREGQSV,nt,S,118,true,"N-terminal ChaFRADIC",92,26010716,"MASCOT Score",34.8100000,,,,,0.00018380000256002,
SHQGEIPYREGQ,nt,S,118,true,"N-terminal ChaFRADIC",92,26010716,"MASCOT Score",27.5200000,,,,,8.627000225303E-10,
SHQGEIPYREG,nt,S,118,true,"N-terminal ChaFRADIC",92,26010716,"MASCOT Score",29.1700000,,,,,3.514000113114E-8,
ALGDLGNSE,nt,A,156,true,"N-terminal ChaFRADIC",92,26010716,"MASCOT Score",89.4400000,,,,,0.0006833000225015,
TVSLCVK,sno,C,169,false,"hot5-4 / wildtype, FAT-switch S-nitrosoproteome",169,37277371,,,,,,,,
TVSLCVKR,ac,K,171,false,"Histone deacetylases - hda14 vs WT (thylakoids)",98d,29061669,"MaxQuant Score",125.3000000,1.0000000,0.0970000,0.9749896,NO,0.00016799999866635,
LVYTNDQGETVK,ph,T,176,true,"Tissue atlas Arabidopsis - ProteomicsDB",114,32188942,"MaxQuant score",160.4600000,1.0000000,,,,1.6129000357523E-9,
RLVYTNDQGETVK,ph,T,182,true,"atm and atr DNA damage response",88,25561503,"MASCOT Score",25.0000000,1.0000000,,,,,-1.7400000
RLVYTNDQGETVK,ph,T,182,true,"TOR Kinase and ABA Receptor",100,29290610,XCorr,3.5349219,1.0000000,,,,8.3040004028589E-6,
LVYTNDQGETVK,ph,T,182,true,"atm and atr DNA damage response",88,25561503,"MASCOT Score",50.0000000,1.0000000,,,,,0.6600000
LVYTNDQGETVK,ph,T,182,true,"Tissue atlas Arabidopsis - ProteomicsDB",114,32188942,"MaxQuant score",152.1600000,1.0000000,,,,7.8990098018039E-7,
LVYTNDQGETVKGVCSNFLCDLAPGSDVK,ac,K,184,true,"Histone deacetylases - hda14 vs WT (thylakoids)",98d,29061669,"MaxQuant Score",108.7000000,1.0000000,-0.2310000,0.8394600,NO,2.5499998952388E-31,
EMLMPK,mox,M,210,false,"cat2 Methionine oxidation - 1h stress",62a,25693801,"MASCOT Score",28.0000000,,-0.0012985,,NO,,
EMLMPK,mox,M,210,false,"cat2 Methionine oxidation - 3h stress",62b,25693801,"MASCOT Score",30.0000000,,0.0447715,,NO,,
EMLMPK,mox,M,212,false,"cat2 Methionine oxidation - 1h stress",62a,25693801,"MASCOT Score",28.0000000,,-0.0012985,,NO,,
EMLMPK,mox,M,212,false,"cat2 Methionine oxidation - 3h stress",62b,25693801,"MASCOT Score",30.0000000,,0.0447715,,NO,,
MFFEKHDDYK,ac,K,243,true,"Histone deacetylases - apicidin vs control",98a,29061669,"MaxQuant Score",50.0000000,1.0000000,0.2650000,0.2766942,NO,0.0060000000521541,
MFFEKHDDYK,ac,K,243,true,"Histone deacetylases substrates - hda14 vs WT",98e,29061669,"MaxQuant Score",60.3000000,1.0000000,0.2770000,0.6886523,NO,0.0020000000949949,
MFFEKHDDYK,ac,K,243,true,"Quantitative Acetylproteomics",101,29440448,,,,,,,,
GEKMYIQTR,ac,K,299,false,"Histone deacetylases - apicidin vs control",98a,29061669,"MaxQuant Score",164.7000000,1.0000000,0.0770000,0.6606934,NO,4.8000000544697E-18,
GEKMYIQTR,ac,K,299,false,"Histone deacetylases substrates - TSA vs control",98b,29061669,"MaxQuant Score",164.7000000,1.0000000,-0.0300000,0.9977001,NO,4.8000000544697E-18,
GEKMYIQTR,ac,K,299,false,"Histone deacetylases- hda14 vs WT (low light)",98c,29061669,"MaxQuant Score",145.4800000,1.0000000,-0.1340000,0.9885531,NO,1.4000000048142E-9,
GEKMYIQTR,ac,K,299,false,"Histone deacetylases - hda14 vs WT (thylakoids)",98d,29061669,"MaxQuant Score",108.7000000,1.0000000,0.0920000,0.9749896,NO,0.0010000000474975,
GEKMYIQTR,ac,K,299,false,"Histone deacetylases substrates - hda14 vs WT",98e,29061669,"MaxQuant Score",133.4000000,1.0000000,-0.0040000,0.9954054,NO,1.699999949839E-12,
DNTFVYMCGLK,acy,C,327,false,"Arabidopsis S-acylation atlas - Silique",163e,35681017,,,,,,,,
DNTFVYMCGLK,sno,C,327,false,"Cold stress nitrosylation - 4°C vs 22°C",65,24388526,,,,,,,,
DNTFVYMCGLKGMEK,ac,K,330,false,"Histone deacetylases- hda14 vs WT (low light)",98c,29061669,"MaxQuant Score",174.5200000,1.0000000,-2.1920000,0.8016781,NO,5.0999997410969E-13,
DNTFVYMCGLKGMEK,ac,K,330,false,"Histone deacetylases - hda14 vs WT (thylakoids)",98d,29061669,"MaxQuant Score",105.3000000,1.0000000,-0.1980000,0.8550667,NO,1.5200000147431E-9,
