Peptide,PTM,ModifiedAA,ModifiedPosition,PeptideUniqueToGene,ExperimentDesc,ExpID,PubmedID,ScoreType,IdentScore,LocProb,Log2FChange,PQ-val,QuantSig,PEP,MassErrorPPM
EILHIQGGQCGNQIGSK,sno,C,12,false,"Site-specific nitrosomeproteomic id - gsnor1-3",90a,25699590,XCorr,2.3224378,,,,,0.045449998229742,-4.2470897
EILHIQGGQCGNQIGSK,sno,C,12,false,"Site-specific nitrosomeproteomic id - gsnor1-3",90b,25699590,XCorr,2.5700000,,,,,0.00077929999679327,-7.1700000
EILHIQGGQCGNQIGSK,sno,C,12,false,"hot5-4 / wildtype, FAT-switch S-nitrosoproteome",169,37277371,,,,,,,,
MREILHIQGGQCGNQIGSK,so,C,12,false,"S-sulfenylation site detection using YAP1C",110,32714340,,,,,,,,
EILHIQGGQCGNQIGSK,so,C,12,false,"Arabidopsis S-sulfenylation chemoproteomics",108,31578252,"pFind PSM Score",0.2107650,,,,,,-1.9473781
QIGSKFWEVICDEHGID,nt,Q,15,true,"HUNTER N-terminome: legumain, GluC and trypsin",119,31951383,"MaxQuant score",,,,,,,
FWEVICDEHGIDSTGR,acy,C,25,true,"Arabidopsis S-acylation atlas - Stem",163f,35681017,,,,,,,,
FWEVICDEHGIDSTGR,sno,C,25,true,"Site-specific nitrosomeproteomic id - gsnor1-3",90a,25699590,XCorr,4.3517280,,,,,0.035339999943972,-6.4782625
FWEVICDEHGIDSTGR,sno,C,25,true,"Site-specific nitrosomeproteomic id - gsnor1-3",90b,25699590,XCorr,4.0400000,,,,,1.6449999975521E-6,-6.6900000
DEHGIDSTGR,nt,D,26,true,"Arg/N-end rule seed, prt6 vs. Wt",99,29168982,"MASCOT Score",40.2500000,,-0.4666879,0.1383593,NO,0.047309998422861,-1.2116728
INVYYNEASGGR,ph,S,56,false,"Tissue atlas Arabidopsis - ProteomicsDB",114,32188942,"MaxQuant score",62.0810000,0.9996560,,,,0.010182400234044,
QSGAGNNWAKGHYTE,nt,Q,95,false,"HUNTER N-terminome: legumain, GluC and trypsin",119,31951383,"MaxQuant score",63.4730000,,,,,,
EAENCDCLQGFQVCHSLGGGTGSGMGTLLISK,so,C,137,false,"S-sulfenylation site detection using YAP1C",110,32714340,,,,,,,,
SLGGGTGSGMGTLLISKIREEYPDR,nt,S,139,false,"Arabidopsis translation initiation landscape - NT",167b,35069635,,,,,,,,
PYNATLSVHQLVE,nt,P,183,false,"Arg/N-end rule seed, prt6 vs. Wt",99,29168982,"MASCOT Score",32.9900000,,,,,0.00049619999481365,0.7317970
PYNATLSVHQLVE,nta,P,183,false,"Arg/N-end rule seed, prt6 vs. Wt",99,29168982,"MASCOT Score",32.9900000,,,,,0.00049619999481365,0.7317970
SVHQLVENADECMVLDNEALY,nt,S,189,false,"Arabidopsis translation initiation landscape - NT",167b,35069635,,,,,,,,
KLAVNLIPFPR,cr,K,253,false,"Open search Plant PTM Viewer 2.0 - Crotonylation",164c,TBA,,,,,,,,
KLAVNLIPFPR,hib,K,253,false,"Open search Plant PTM Viewer 2.0 - hib",164e,TBA,,,,,,,,
NMMCAADPR,nt,N,299,false,"Metacaspase9 substrates - in vitro rMC9",51c,23964026,"MASCOT Score",41.0000000,,,,,,-0.3429202
NMMCAADPR,acy,C,302,false,"Arabidopsis S-acylation atlas - Meristem",163a,35681017,,,,,,,,
NMMCAADPR,acy,C,302,false,"Arabidopsis S-acylation atlas - Silique",163e,35681017,,,,,,,,
NMMCAADPR,ox,C,302,false,"OxiTRAQ Arabidopsis - 5 mM H2O2 versus control",47,24376095,,,,0.0163092,0.7707895,NO,,
NMMCAADPR,sno,C,302,false,"Endogenous S-nitrosylation in Arabidopsis",64,22115780,"MASCOT Score",33.0000000,,,,,,
NMMCAADPR,sno,C,302,false,"hot5-4 / wildtype, FAT-switch S-nitrosoproteome",169,37277371,,,,,,,,
NMMCAADPR,so,C,302,false,"S-sulfenylation site detection using YAP1C",110,32714340,,,,,,,,
QILNIQNKNSSYFVE,nt,Q,330,true,"HUNTER N-terminome: legumain, GluC and trypsin",119,31951383,"MaxQuant score",,,,,,,
NKNSSYFVE,nt,N,336,false,"Arg/N-end rule seed, prt6 vs. Wt",99,29168982,"MASCOT Score",24.2400000,,,,,0.0081970002502203,0.4198821
SSVCDIPPK,sno,C,355,true,"Site-specific nitrosomeproteomic id - gsnor1-3",90a,25699590,XCorr,2.1683247,,,,,0.16200000047684,-6.3611133
SSVCDIPPK,sno,C,355,true,"hot5-4 / wildtype, FAT-switch S-nitrosoproteome",169,37277371,,,,0.2047028,0.0015844,NO,,
FVGNSTSIQE,nt,F,368,false,"Arg/N-end rule seed, prt6 vs. Wt",99,29168982,"MASCOT Score",51.1400000,,-0.2695502,0.1820338,NO,0.00086789997294545,-2.2357245
