Peptide,PTM,ModifiedAA,ModifiedPosition,PeptideUniqueToGene,ExperimentDesc,ExpID,PubmedID,ScoreType,IdentScore,LocProb,Log2FChange,PQ-val,QuantSig,PEP,MassErrorPPM
GRSPASSCLRLISCSGGDDTSADPNSTALE,nt,G,2,true,"HUNTER N-terminome: legumain, GluC and trypsin",119,31951383,"MaxQuant score",86.9820000,,,,,,
GRSPASSCLRLISCSGGDDTSADPN,nt,G,2,true,"HUNTER N-terminome: legumain, GluC and trypsin",119,31951383,"MaxQuant score",86.8560000,,,,,,
GRSPASSCLR,ph,S,4,true,"atm and atr DNA damage response",88,25561503,"MASCOT Score",31.0000000,1.0000000,,,,,-0.7900000
GRSPASSCLR,ph,S,4,true,"Tissue atlas Arabidopsis - ProteomicsDB",114,32188942,"MaxQuant score",65.8950000,0.9990470,,,,0.0023797999601811,
GRSPASSCLR,acy,C,9,true,"Arabidopsis S-acylation atlas - Hypocotyl",163b,35681017,,,,,,,,
GRSPASSCLR,acy,C,9,true,"Arabidopsis S-acylation atlas - Leaf",163c,35681017,,,,,,,,
GRSPASSCLR,acy,C,9,true,"Arabidopsis S-acylation atlas - Seedling",163d,35681017,,,,,,,,
SPASSCLR,acy,C,9,true,"Arabidopsis S-acylation atlas - Hypocotyl",163b,35681017,,,,,,,,
LISCSGGDDTSADPNSTALENKSSGDK,acy,C,15,true,"Arabidopsis S-acylation atlas - Seedling",163d,35681017,,,,,,,,
LISCSGGDDTSADPNSTALENK,acy,C,15,true,"Arabidopsis S-acylation atlas - Hypocotyl",163b,35681017,,,,,,,,
LISCSGGDDTSADPNSTALENK,acy,C,15,true,"Arabidopsis S-acylation atlas - Leaf",163c,35681017,,,,,,,,
LISCSGGDDTSADPNSTALENK,acy,C,15,true,"Arabidopsis S-acylation atlas - Seedling",163d,35681017,,,,,,,,
LISCSGGDDTSADPNSTALENK,acy,C,15,true,"Arabidopsis S-acylation atlas - Stem",163f,35681017,,,,,,,,
LISCSGGDDTSADPNSTALENK,ph,S,22,true,"Tissue atlas Arabidopsis - ProteomicsDB",114,32188942,"MaxQuant score",294.1700000,0.9938860,,,,0,
LISCSGGDDTSADPNSTALENK,ph,S,27,true,"Tissue atlas Arabidopsis - ProteomicsDB",114,32188942,"MaxQuant score",170.3200000,0.8273870,,,,1.9618178500547E-44,
RGWSFR,ph,S,42,true,"srk2dei ABA signaling phopshoproteomics",83,23572148,"MASCOT Score",23.0000000,,,,,,0.0001000
SVVSETTPASR,nt,S,56,true,"Tic56 chloroplast import - tic56-1",89c,25588737,XCorr,2.3660676,,,,,,
GLITSVVSETTPASR,ph,S,59,true,"TOR Kinase and ABA Receptor",100,29290610,XCorr,4.3701653,0.9872000,,,,1.5399999711008E-6,
GLITSVVSETTPASR,ph,S,59,true,"Tissue atlas Arabidopsis - ProteomicsDB",114,32188942,"MaxQuant score",252.6600000,0.9986160,,,,0,
GLITSVVSETTPASR,ph,T,62,true,"Large-scale phosphorylation discovery",44,23111157,XCorr,4.4650000,,,,,,
GLITSVVSETTPASR,ph,T,62,true,"atm and atr DNA damage response",88,25561503,"MASCOT Score",51.0000000,0.9480000,,,,,-0.8800000
GLITSVVSETTPASR,ph,T,62,true,"Tissue atlas Arabidopsis - ProteomicsDB",114,32188942,"MaxQuant score",247.1700000,0.9348410,,,,0,
GLITSVVSETTPASR,ph,S,65,true,"atm and atr DNA damage response",88,25561503,"MASCOT Score",51.0000000,1.0000000,,,,,-0.8800000
GLITSVVSETTPASR,ph,S,65,true,"Tissue atlas Arabidopsis - ProteomicsDB",114,32188942,"MaxQuant score",248.0600000,0.9528590,,,,0,
TRETLESALLKSPSPDNNNVSEK,ph,S,78,true,"Arabidopsis root NAA phosphoproteome",18a,27643528,"MaxQuant Score",73.9360000,1.0000000,,,,1.5829999711059E-7,2.2870000
TRETLESALLKSPSPDNNNVSEK,ph,S,78,true,"Plasmamembrane phosphorylation",20,15308754,,,,,,,,
TRETLESALLKSPSPDNNNVSEK,ph,S,78,true,"Ph protein kinases and peptide chip analysis",27,18433157,,,,,,,,
TRETLESALLKSPSPDNNNVSEK,ph,S,78,true,"STN8 phosphoproteome",38,21768351,"MASCOT Score",59.3500000,,,,,,
TRETLESALLKSPSPDNNNVSEK,ph,S,78,true,"Chloroplast kinase substrates",60,19376835,"MASCOT Score",41.9900000,,,,,,-0.1136710
TRETLESALLKSPSPDNNNVSEK,ph,S,78,true,"Conserved plant phosphoproteome - Arabidopsis",61a,20466843,"MASCOT Score",24.0000000,1.0000000,,,,,
TRETLESALLKSPSPDNNNVSEK,ph,S,78,true,"srk2dei ABA signaling phopshoproteomics",83,23572148,"MASCOT Score",53.0000000,,,,,,0.0021000
TRETLESALLKSPSPDNNNVSEK,ph,S,78,true,"LAXIC - ABA stress",84a,23660473,XCorr,4.2600000,0.9740000,,,,0.04001110047102,
TRETLESALLKSPSPDNNNVSEK,ph,S,78,true,"LAXIC - mannitol vs control",84b,23660473,XCorr,4.3100000,0.9990000,,,,0.00011117199755972,
TRETLESALLKSPSPDNNNVSEK,ph,S,78,true,"SnRK2 protein kinase substrates",85,23776212,XCorr,4.3634419,1.0000000,,,,0.0026506800204515,
TRETLESALLKSPSPDNNNVSEK,ph,S,78,true,"Brassinosteroid-Regulated Phosphorylation Dynamics",94,26187819,"MaxQuant Score",119.2800000,1.0000000,,,,2.195999968535E-6,1.9790000
TRETLESALLKSPSPDNNNVSEK,ph,S,78,true,"TOR Kinase and ABA Receptor",100,29290610,XCorr,4.1125197,0.9981000,,,,0.0036230001132935,
TRETLESALLKSPSPDNNNVSEK,ph,S,78,true,"Tissue atlas Arabidopsis - ProteomicsDB",114,32188942,"MaxQuant score",426.1500000,1.0000000,,,,0,
ETLESALLKSPSPDNNNVSEK,ph,S,78,true,"Plasmembrane Ph Immune Responses",25,17651370,,,,,,,,
ETLESALLKSPSPDNNNVSEK,ph,S,78,true,"Phytohormone-responsive phosphoproteins",34,20374526,"MASCOT Score",45.0000000,,,,,,-1.0171900
ETLESALLKSPSPDNNNVSEK,ph,S,78,true,"STN8 phosphoproteome",38,21768351,"MASCOT Score",48.5600000,,,,,,1.9510900
ETLESALLKSPSPDNNNVSEK,ph,S,78,true,"Phosphoproteomic analysis of seed maturation",42,22440515,"MASCOT Score",40.0000000,,,,,,-0.9900000
ETLESALLKSPSPDNNNVSEK,ph,S,78,true,"PAMP-triggered phosphorylation",48,24601666,"MASCOT Score",54.0000000,,,,,,
ETLESALLKSPSPDNNNVSEK,ph,S,78,true,"srk2dei ABA signaling phopshoproteomics",83,23572148,"MASCOT Score",71.0000000,,,,,,-0.0004000
ETLESALLKSPSPDNNNVSEK,ph,S,78,true,"LAXIC - ABA stress",84a,23660473,XCorr,4.3500000,0.9110000,,,,1.1800000265794E-6,
ETLESALLKSPSPDNNNVSEK,ph,S,78,true,"LAXIC - mannitol vs control",84b,23660473,XCorr,4.8500000,0.9990000,,,,1.6600000263267E-9,
ETLESALLKSPSPDNNNVSEK,ph,S,78,true,"SnRK2 protein kinase substrates",85,23776212,XCorr,4.6774735,1.0000000,,,,0.0055376598611474,
ETLESALLKSPSPDNNNVSEK,ph,S,78,true,"atm and atr DNA damage response",88,25561503,"MASCOT Score",35.0000000,1.0000000,,,,,-0.5400000
ETLESALLKSPSPDNNNVSEK,ph,S,78,true,"Brassinosteroid-Regulated Phosphorylation Dynamics",94,26187819,"MaxQuant Score",119.2800000,1.0000000,,,,2.195999968535E-6,1.7020000
ETLESALLKSPSPDNNNVSEK,ph,S,78,true,"TOR Kinase and ABA Receptor",100,29290610,XCorr,4.6327839,0.9976000,,,,0.00015409999468829,
ETLESALLKSPSPDNNNVSEK,ph,S,78,true,"Phospho cell culture sucrose/TOR",109,30833711,,,0.9999960,,,,,
ETLESALLKSPSPDNNNVSEK,ph,S,78,true,"Col-0 callus - FC Col-0 vs. Col-0 Xray",111a,31410901,,36.2400000,,-0.2842918,0.0000000,NO,,0.8377909
ETLESALLKSPSPDNNNVSEK,ph,S,78,true,"Col-0 X-ray callus - FC Col-0 vs. Col-0 Xray",111b,31410901,,36.2400000,,-0.2842918,0.0000000,NO,,0.8377909
ETLESALLKSPSPDNNNVSEK,ph,S,78,true,"atm callus - FC atm vs. atm Xray",111c,31410901,,36.2400000,,-1.0064335,0.0000000,NO,,0.8377909
ETLESALLKSPSPDNNNVSEK,ph,S,78,true,"atm-3 X-ray callus - FC atm vs. atm Xray",111d,31410901,,36.2400000,,-1.0064335,0.0000000,NO,,0.8377909
SPSPDNNNVSEK,ph,S,78,true,"atm and atr DNA damage response",88,25561503,"MASCOT Score",61.0000000,1.0000000,,,,,-0.1000000
TRETLESALLKSPSPDNNNVSEK,ph,S,80,true,"Arabidopsis root NAA phosphoproteome",18a,27643528,"MaxQuant Score",73.9360000,1.0000000,,,,1.5829999711059E-7,2.2870000
TRETLESALLKSPSPDNNNVSEK,ph,S,80,true,"Ph protein kinases and peptide chip analysis",27,18433157,,,,,,,,
TRETLESALLKSPSPDNNNVSEK,ph,S,80,true,"STN8 phosphoproteome",38,21768351,"MASCOT Score",54.8900000,,,,,,-1.0864200
TRETLESALLKSPSPDNNNVSEK,ph,S,80,true,"Chloroplast kinase substrates",60,19376835,"MASCOT Score",45.9800000,,,,,,-1.0864200
TRETLESALLKSPSPDNNNVSEK,ph,S,80,true,"Conserved plant phosphoproteome - Arabidopsis",61a,20466843,"MASCOT Score",24.0000000,1.0000000,,,,,
TRETLESALLKSPSPDNNNVSEK,ph,S,80,true,"srk2dei ABA signaling phopshoproteomics",83,23572148,"MASCOT Score",53.0000000,,,,,,0.0021000
TRETLESALLKSPSPDNNNVSEK,ph,S,80,true,"LAXIC - ABA stress",84a,23660473,XCorr,4.2600000,0.9210000,,,,0.04001110047102,
TRETLESALLKSPSPDNNNVSEK,ph,S,80,true,"LAXIC - mannitol vs control",84b,23660473,XCorr,4.3100000,0.9930000,,,,0.00011117199755972,
TRETLESALLKSPSPDNNNVSEK,ph,S,80,true,"SnRK2 protein kinase substrates",85,23776212,XCorr,4.3634419,1.0000000,,,,0.0026506800204515,
TRETLESALLKSPSPDNNNVSEK,ph,S,80,true,"Brassinosteroid-Regulated Phosphorylation Dynamics",94,26187819,"MaxQuant Score",119.2800000,0.9870000,,,,2.195999968535E-6,1.9790000
TRETLESALLKSPSPDNNNVSEK,ph,S,80,true,"TOR Kinase and ABA Receptor",100,29290610,XCorr,4.1125197,0.9935000,,,,0.0036230001132935,
TRETLESALLKSPSPDNNNVSEK,ph,S,80,true,"Phospho cell culture sucrose/TOR",109,30833711,,,0.9999940,,,,,
TRETLESALLKSPSPDNNNVSEK,ph,S,80,true,"Tissue atlas Arabidopsis - ProteomicsDB",114,32188942,"MaxQuant score",426.1500000,1.0000000,,,,0,
ETLESALLKSPSPDNNNVSEK,ph,S,80,true,"Plasmembrane Ph Immune Responses",25,17651370,,,,,,,,
ETLESALLKSPSPDNNNVSEK,ph,S,80,true,"Phytohormone-responsive phosphoproteins",34,20374526,"MASCOT Score",45.0000000,,,,,,-1.0171900
ETLESALLKSPSPDNNNVSEK,ph,S,80,true,"PAMP-triggered phosphorylation",48,24601666,"MASCOT Score",54.0000000,,,,,,
ETLESALLKSPSPDNNNVSEK,ph,S,80,true,"srk2dei ABA signaling phopshoproteomics",83,23572148,"MASCOT Score",71.0000000,,,,,,-0.0004000
ETLESALLKSPSPDNNNVSEK,ph,S,80,true,"LAXIC - ABA stress",84a,23660473,XCorr,4.3500000,0.9200000,,,,1.1800000265794E-6,
ETLESALLKSPSPDNNNVSEK,ph,S,80,true,"LAXIC - mannitol vs control",84b,23660473,XCorr,4.8500000,0.9910000,,,,1.6600000263267E-9,
ETLESALLKSPSPDNNNVSEK,ph,S,80,true,"SnRK2 protein kinase substrates",85,23776212,XCorr,4.6774735,1.0000000,,,,0.0055376598611474,
ETLESALLKSPSPDNNNVSEK,ph,S,80,true,"atm and atr DNA damage response",88,25561503,"MASCOT Score",35.0000000,1.0000000,,,,,-0.5400000
ETLESALLKSPSPDNNNVSEK,ph,S,80,true,"Brassinosteroid-Regulated Phosphorylation Dynamics",94,26187819,"MaxQuant Score",119.2800000,1.0000000,,,,2.195999968535E-6,1.7020000
ETLESALLKSPSPDNNNVSEK,ph,S,80,true,"TOR Kinase and ABA Receptor",100,29290610,XCorr,4.6327839,0.9994000,,,,0.00015409999468829,
ETLESALLKSPSPDNNNVSEK,ph,S,80,true,"Col-0 callus - FC Col-0 vs. Col-0 Xray",111a,31410901,,51.3500000,,-0.1746739,0.0000000,NO,,1.3001129
ETLESALLKSPSPDNNNVSEK,ph,S,80,true,"Col-0 X-ray callus - FC Col-0 vs. Col-0 Xray",111b,31410901,,51.3500000,,-0.1746739,0.0000000,NO,,1.3001129
ETLESALLKSPSPDNNNVSEK,ph,S,80,true,"atm callus - FC atm vs. atm Xray",111c,31410901,,51.3500000,,-0.1606081,0.0000000,NO,,1.3001129
ETLESALLKSPSPDNNNVSEK,ph,S,80,true,"atm-3 X-ray callus - FC atm vs. atm Xray",111d,31410901,,51.3500000,,-0.1606081,0.0000000,NO,,1.3001129
SPSPDNNNVSEK,ph,S,80,true,"STN8 phosphoproteome",38,21768351,"MASCOT Score",40.0800000,,,,,,-0.5446490
SPSPDNNNVSEK,ph,S,80,true,"SnRK2 protein kinase substrates",85,23776212,XCorr,2.5614970,0.8750000,,,,0.034529399126768,
SPSPDNNNVSEK,ph,S,80,true,"atm and atr DNA damage response",88,25561503,"MASCOT Score",76.0000000,1.0000000,,,,,-2.0100000
TRETLESALLKSPSPDNNNVSEK,ph,S,87,true,"srk2dei ABA signaling phopshoproteomics",83,23572148,"MASCOT Score",41.0000000,,,,,,0.0022000
ETLESALLKSPSPDNNNVSEK,ph,S,87,true,"atm and atr DNA damage response",88,25561503,"MASCOT Score",34.0000000,1.0000000,,,,,2.3100000
QQQSFSVDEK,ph,S,93,true,"atm and atr DNA damage response",88,25561503,"MASCOT Score",37.0000000,0.9500000,,,,,1.5400000
QQQSFSVDEK,ph,S,93,true,"TOR Kinase and ABA Receptor",100,29290610,XCorr,2.4141793,0.9989000,,,,0.0029970000032336,
QQQSFSVDEK,ph,S,93,true,"Tissue atlas Arabidopsis - ProteomicsDB",114,32188942,"MaxQuant score",169.8100000,0.9999030,,,,1.8723800110365E-7,
KTQSVIEEK,ph,S,120,true,"atm and atr DNA damage response",88,25561503,"MASCOT Score",39.0000000,1.0000000,,,,,-1.8500000
KTQSVIEEK,ph,S,120,true,"Tissue atlas Arabidopsis - ProteomicsDB",114,32188942,"MaxQuant score",209.6700000,1.0000000,,,,2.4486200492795E-16,
TELLSVEEQIDHR,ph,S,130,true,"Tissue atlas Arabidopsis - ProteomicsDB",114,32188942,"MaxQuant score",236.0500000,1.0000000,,,,0,
TEVSPVIVESK,ph,S,142,true,"STN8 phosphoproteome",38,21768351,"MASCOT Score",63.1000000,,,,,,-0.9911380
TEVSPVIVESK,ph,S,142,true,"Chloroplast kinase substrates",60,19376835,"MASCOT Score",47.6800000,,,,,,-0.9596070
TEVSPVIVESK,ph,S,142,true,"LAXIC - ABA stress",84a,23660473,XCorr,2.7000000,1.0000000,,,,0.017271200194955,
TEVSPVIVESK,ph,S,142,true,"SnRK2 protein kinase substrates",85,23776212,XCorr,2.4631233,1.0000000,,,,0.029074700549245,
TEVSPVIVESK,ph,S,142,true,"atm and atr DNA damage response",88,25561503,"MASCOT Score",68.0000000,1.0000000,,,,,-0.4700000
TEVSPVIVESK,ph,S,142,true,"TOR Kinase and ABA Receptor",100,29290610,XCorr,3.4333355,1.0000000,,,,1.4530000044033E-5,
TEVSPVIVESK,ph,S,142,true,"Col-0 callus - FC Col-0 vs. Col-0 Xray",111a,31410901,,39.1200000,,-1.1141801,0.0000000,NO,,-0.6108508
TEVSPVIVESK,ph,S,142,true,"Col-0 X-ray callus - FC Col-0 vs. Col-0 Xray",111b,31410901,,39.1200000,,-1.1141801,0.0000000,NO,,-0.6108508
TEVSPVIVESK,ph,S,142,true,"atm callus - FC atm vs. atm Xray",111c,31410901,,39.1200000,,-2.0125377,0.0000000,NO,,-0.6108508
TEVSPVIVESK,ph,S,142,true,"atm-3 X-ray callus - FC atm vs. atm Xray",111d,31410901,,39.1200000,,-2.0125377,0.0000000,NO,,-0.6108508
TEVSPVIVESK,ph,S,142,true,"Tissue atlas Arabidopsis - ProteomicsDB",114,32188942,"MaxQuant score",234.7900000,1.0000000,,,,1.3774763904313E-42,
TEVSPVIVESK,ph,S,142,true,"Touch-induced phosphorylation: 40s touch vs untouc",136,30291188,"MASCOT score",67.3900000,,-0.1369636,0.7084524,NO,,4.8561248
TEVSPVIVESK,ph,S,148,true,"Tissue atlas Arabidopsis - ProteomicsDB",114,32188942,"MaxQuant score",113.2500000,0.9999770,,,,3.1237199436873E-5,
GTETEEDDLIGTELQGPSAADAAK,ph,T,151,true,"SnRK2 protein kinase substrates",85,23776212,XCorr,5.9156656,0.9280000,,,,8.2489401975749E-9,
GTETEEDDLIGTELQGPSAADAAK,ph,T,151,true,"Lateral root-induction - NAA vs control",106,23328941,"MASCOT Score",58.0000000,,,,,,
GTETEEDDLIGTELQGPSAADAAK,ph,T,151,true,"Phospho cell culture sucrose/TOR",109,30833711,,,0.9214840,,,,,
GTETEEDDLIGTELQGPSAADAAK,ph,T,151,true,"Tissue atlas Arabidopsis - ProteomicsDB",114,32188942,"MaxQuant score",416.8800000,0.8867000,,,,0,
GTETEEDDLIGTELQGPSAADAAK,ph,T,153,true,"LAXIC - ABA stress",84a,23660473,XCorr,5.9400000,0.8440000,,,,2.5999999375692E-10,
GTETEEDDLIGTELQGPSAADAAK,ph,T,153,true,"Phospho cell culture sucrose/TOR",109,30833711,,,0.9540220,,,,,
GTETEEDDLIGTELQGPSAADAAK,ph,T,153,true,"Col-0 callus - FC Col-0 vs. Col-0 Xray",111a,31410901,,76.7700000,,0.0030925,0.0000000,NO,,1.8459322
GTETEEDDLIGTELQGPSAADAAK,ph,T,153,true,"Col-0 X-ray callus - FC Col-0 vs. Col-0 Xray",111b,31410901,,76.7700000,,0.0030925,0.0000000,NO,,1.8459322
GTETEEDDLIGTELQGPSAADAAK,ph,T,153,true,"atm callus - FC atm vs. atm Xray",111c,31410901,,76.7700000,,0.0504723,0.0000000,NO,,1.8459322
GTETEEDDLIGTELQGPSAADAAK,ph,T,153,true,"atm-3 X-ray callus - FC atm vs. atm Xray",111d,31410901,,76.7700000,,0.0504723,0.0000000,NO,,1.8459322
GTETEEDDLIGTELQGPSAADAAK,ph,T,153,true,"Tissue atlas Arabidopsis - ProteomicsDB",114,32188942,"MaxQuant score",514.3300000,0.9990140,,,,0,
IEEDVTSEVEMASK,ph,T,179,true,"Tyrosine phosphorylation in Arabidopsis",59,18463617,"MASCOT Score",57.0000000,,,,,,-0.6076522
IEEDVTSEVEMASK,ph,T,179,true,"LAXIC - ABA stress",84a,23660473,XCorr,4.4900000,0.9740000,,,,0.016466600820422,
IEEDVTSEVEMASK,ph,S,180,true,"Phosphorylation nuclei-enriched fractions",28,19245862,,,,,,,,
IEEDVTSEVEMASK,ph,S,180,true,"Phosphoproteomic analysis of seed maturation",42,22440515,"MASCOT Score",47.0000000,,,,,,-1.3000000
IEEDVTSEVEMASK,ph,S,180,true,"Large-scale phosphorylation discovery",44,23111157,XCorr,5.4310000,,,,,,
IEEDVTSEVEMASK,ph,S,180,true,"Tyrosine phosphorylation in Arabidopsis",59,18463617,"MASCOT Score",69.0000000,,,,,,-1.5191318
IEEDVTSEVEMASK,ph,S,180,true,"srk2dei ABA signaling phopshoproteomics",83,23572148,"MASCOT Score",25.0000000,,,,,,0.0011000
IEEDVTSEVEMASK,ph,S,180,true,"LAXIC - ABA stress",84a,23660473,XCorr,4.4400000,0.9990000,,,,0.0062375701963902,
IEEDVTSEVEMASK,ph,S,180,true,"LAXIC - mannitol vs control",84b,23660473,XCorr,3.6900000,0.9420000,,,,3.8799999324546E-10,
IEEDVTSEVEMASK,ph,S,180,true,"SnRK2 protein kinase substrates",85,23776212,XCorr,4.0435405,1.0000000,,,,1.5822999854809E-10,
IEEDVTSEVEMASK,ph,S,180,true,"atm and atr DNA damage response",88,25561503,"MASCOT Score",25.0000000,0.9970000,,,,,-1.2500000
IEEDVTSEVEMASK,ph,S,180,true,"TOR Kinase and ABA Receptor",100,29290610,XCorr,4.8369260,0.9970000,,,,5.8820000958804E-7,
IEEDVTSEVEMASK,ph,S,180,true,"Lateral root-induction - NAA vs control",106,23328941,"MASCOT Score",34.0000000,,,,,,
IEEDVTSEVEMASK,ph,S,180,true,"Phospho cell culture sucrose/TOR",109,30833711,,,0.9950080,,,,,
IEEDVTSEVEMASK,ph,S,180,true,"Tissue atlas Arabidopsis - ProteomicsDB",114,32188942,"MaxQuant score",260.5000000,0.9987650,,,,0,
VEPEESESDDVIIVRK,ph,S,193,true,"STN8 phosphoproteome",38,21768351,"MASCOT Score",55.2800000,,,,,,-1.9270500
VEPEESESDDVIIVRK,ph,S,193,true,"Chloroplast kinase substrates",60,19376835,"MASCOT Score",40.0600000,,,,,,-1.9270500
VEPEESESDDVIIVR,ph,S,193,true,"Arabidopsis root NAA phosphoproteome",18a,27643528,"MaxQuant Score",122.0100000,0.9760000,,,,2.1019999397565E-17,-0.4570000
VEPEESESDDVIIVR,ph,S,193,true,"Plasmamembrane phosphorylation",20,15308754,,,,,,,,
VEPEESESDDVIIVR,ph,S,193,true,"Sucrose-induced phosphorylation",24,17586839,,,,,,,,
VEPEESESDDVIIVR,ph,S,193,true,"Plasmembrane Ph Immune Responses",25,17651370,,,,,,,,
VEPEESESDDVIIVR,ph,S,193,true,"Phosphorylation nuclei-enriched fractions",28,19245862,,,,,,,,
VEPEESESDDVIIVR,ph,S,193,true,"STN8 phosphoproteome",38,21768351,"MASCOT Score",55.3200000,,,,,,-1.0977200
VEPEESESDDVIIVR,ph,S,193,true,"Phosphoproteomic analysis of seed maturation",42,22440515,"MASCOT Score",69.0000000,,,,,,-1.3400000
VEPEESESDDVIIVR,ph,S,193,true,"Large-scale phosphorylation discovery",44,23111157,XCorr,5.4500000,,,,,,
VEPEESESDDVIIVR,ph,S,193,true,"PAMP-triggered phosphorylation",48,24601666,"MASCOT Score",44.6700000,,,,,,
VEPEESESDDVIIVR,ph,S,193,true,"Tyrosine phosphorylation in Arabidopsis",59,18463617,"MASCOT Score",60.0000000,,,,,,-0.6686014
VEPEESESDDVIIVR,ph,S,193,true,"Chloroplast kinase substrates",60,19376835,"MASCOT Score",47.9100000,,,,,,-0.2962940
VEPEESESDDVIIVR,ph,S,193,true,"Conserved plant phosphoproteome - Arabidopsis",61a,20466843,"MASCOT Score",25.0000000,1.0000000,,,,,
VEPEESESDDVIIVR,ph,S,193,true,"srk2dei ABA signaling phopshoproteomics",83,23572148,"MASCOT Score",56.0000000,,,,,,0.0023000
VEPEESESDDVIIVR,ph,S,193,true,"LAXIC - ABA stress",84a,23660473,XCorr,5.2700000,1.0000000,,,,1.6000000213623E-9,
VEPEESESDDVIIVR,ph,S,193,true,"LAXIC - mannitol vs control",84b,23660473,XCorr,5.3700000,1.0000000,-1.8219117,,NO,9.9900001465647E-12,
VEPEESESDDVIIVR,ph,S,193,true,"SnRK2 protein kinase substrates",85,23776212,XCorr,5.2126875,1.0000000,,,,1.7867199690255E-12,
VEPEESESDDVIIVR,ph,S,193,true,"atm and atr DNA damage response",88,25561503,"MASCOT Score",101.0000000,1.0000000,,,,,-0.4900000
VEPEESESDDVIIVR,ph,S,193,true,"TOR Kinase and ABA Receptor",100,29290610,XCorr,5.2322807,0.9951000,,,,4.3899998303232E-8,
VEPEESESDDVIIVR,ph,S,193,true,"Lateral root-induction - NAA vs control",106,23328941,"MASCOT Score",42.0000000,,0.2240137,0.4002565,NO,,
VEPEESESDDVIIVR,ph,S,193,true,"Phosphorylation tonoplast membrane fraction",107,18686298,"MASCOT Score",58.0000000,,,,,,
VEPEESESDDVIIVR,ph,S,193,true,"Phospho cell culture sucrose/TOR",109,30833711,,,0.9928150,,,,,
VEPEESESDDVIIVR,ph,S,193,true,"Col-0 callus - FC Col-0 vs. Col-0 Xray",111a,31410901,,75.7400000,,-0.3255534,0.0000000,NO,,1.7662470
VEPEESESDDVIIVR,ph,S,193,true,"Col-0 X-ray callus - FC Col-0 vs. Col-0 Xray",111b,31410901,,75.7400000,,-0.3255534,0.0000000,NO,,1.7662470
VEPEESESDDVIIVR,ph,S,193,true,"atm callus - FC atm vs. atm Xray",111c,31410901,,75.7400000,,-0.5042167,0.0000000,NO,,1.7662470
VEPEESESDDVIIVR,ph,S,193,true,"atm-3 X-ray callus - FC atm vs. atm Xray",111d,31410901,,75.7400000,,-0.5042167,0.0000000,NO,,1.7662470
VEPEESESDDVIIVR,ph,S,193,true,"Tissue atlas Arabidopsis - ProteomicsDB",114,32188942,"MaxQuant score",226.0900000,1.0000000,,,,0,
VEPEESESDDVIIVR,ph,S,193,true,"Touch-induced phosphorylation: 40s touch vs untouc",136,30291188,"MASCOT score",105.7500000,,-0.1909505,0.6977114,NO,,3.6466875
VEPEESESDDVIIVR,ph,S,195,true,"Plasmamembrane phosphorylation",20,15308754,,,,,,,,
VEPEESESDDVIIVR,ph,S,195,true,"Conserved plant phosphoproteome - Arabidopsis",61a,20466843,"MASCOT Score",25.0000000,1.0000000,,,,,
VEPEESESDDVIIVR,ph,S,195,true,"srk2dei ABA signaling phopshoproteomics",83,23572148,"MASCOT Score",51.0000000,,,,,,0.0002000
VEPEESESDDVIIVR,ph,S,195,true,"SnRK2 protein kinase substrates",85,23776212,XCorr,4.0285950,1.0000000,,,,0.0015536299906671,
VEPEESESDDVIIVR,ph,S,195,true,"atm and atr DNA damage response",88,25561503,"MASCOT Score",67.0000000,1.0000000,,,,,-0.0600000
VEPEESESDDVIIVR,ph,S,195,true,"TOR Kinase and ABA Receptor",100,29290610,XCorr,4.2993569,1.0000000,,,,0.00053999997908249,
VEPEESESDDVIIVR,ph,S,195,true,"Tissue atlas Arabidopsis - ProteomicsDB",114,32188942,"MaxQuant score",179.5600000,1.0000000,,,,5.4765598452366E-25,
VSATSDKSEPNAAAQK,ph,S,289,true,"Tissue atlas Arabidopsis - ProteomicsDB",114,32188942,"MaxQuant score",113.2300000,0.9047070,,,,5.4802899995821E-8,
HLMESTPK,ph,S,313,true,"Tissue atlas Arabidopsis - ProteomicsDB",114,32188942,"MaxQuant score",56.0130000,0.7843550,,,,0.013601900078356,
WMSVPKPEK,ph,S,341,true,"atm and atr DNA damage response",88,25561503,"MASCOT Score",37.0000000,1.0000000,,,,,-2.6700000
WMSVPKPEK,ph,S,341,true,"TOR Kinase and ABA Receptor",100,29290610,XCorr,2.4629750,1.0000000,,,,0.068539999425411,
WMSVPKPEK,ph,S,341,true,"Phospho cell culture sucrose/TOR",109,30833711,,,1.0000000,,,,,
WMSVPKPEK,ph,S,341,true,"Tissue atlas Arabidopsis - ProteomicsDB",114,32188942,"MaxQuant score",154.1500000,1.0000000,,,,0.00012939500447828,
ANLTTEEQNLEETQNVK,ph,T,363,true,"Tissue atlas Arabidopsis - ProteomicsDB",114,32188942,"MaxQuant score",196.6500000,1.0000000,,,,6.5393694785414E-39,
ISPQADFVNSDSTVENK,ph,S,369,true,"STN8 phosphoproteome",38,21768351,"MASCOT Score",83.2100000,,,,,,-0.6575990
ISPQADFVNSDSTVENK,ph,S,369,true,"TOR Kinase and ABA Receptor",100,29290610,XCorr,4.3926058,1.0000000,,,,3.108999919732E-7,
ISPQADFVNSDSTVENK,ph,S,369,true,"Phospho cell culture sucrose/TOR",109,30833711,,,0.9999190,,,,,
ISPQADFVNSDSTVENK,ph,S,369,true,"Tissue atlas Arabidopsis - ProteomicsDB",114,32188942,"MaxQuant score",251.1000000,1.0000000,,,,0,
ISPQADFVNSDSTVENK,ph,S,377,true,"Tissue atlas Arabidopsis - ProteomicsDB",114,32188942,"MaxQuant score",131.1800000,0.9639830,,,,5.3508399967817E-12,
VEGQNVELSETEK,ph,S,405,true,"Tissue atlas Arabidopsis - ProteomicsDB",114,32188942,"MaxQuant score",191.8300000,0.9592690,,,,2.8133899992015E-30,
VEGQNVELSETEK,ph,T,407,true,"Tissue atlas Arabidopsis - ProteomicsDB",114,32188942,"MaxQuant score",166.0300000,0.7749620,,,,2.0362199407609E-14,
RKVSNPSFIAAQSK,ph,S,459,true,"STN8 phosphoproteome",38,21768351,"MASCOT Score",50.9600000,,,,,,0.2446610
RKVSNPSFIAAQSK,ph,S,459,true,"Tyrosine phosphorylation in Arabidopsis",59,18463617,"MASCOT Score",35.0000000,,,,,,-0.9926719
RKVSNPSFIAAQSK,ph,S,459,true,"Chloroplast kinase substrates",60,19376835,"MASCOT Score",48.1000000,,,,,,0.2260830
RKVSNPSFIAAQSK,ph,S,459,true,"srk2dei ABA signaling phopshoproteomics",83,23572148,"MASCOT Score",72.0000000,,,,,,-0.0010000
RKVSNPSFIAAQSK,ph,S,459,true,"Brassinosteroid-Regulated Phosphorylation Dynamics",94,26187819,"MaxQuant Score",132.5100000,1.0000000,,,,5.5880000626729E-10,2.0940000
RKVSNPSFIAAQSK,ph,S,459,true,"TOR Kinase and ABA Receptor",100,29290610,XCorr,4.4713106,1.0000000,,,,1.2849999620812E-5,
KVSNPSFIAAQSK,ph,S,459,true,"Arabidopsis root NAA phosphoproteome",18a,27643528,"MaxQuant Score",87.6760000,1.0000000,,,,1.7970000598666E-8,0.4210000
KVSNPSFIAAQSK,ph,S,459,true,"Phosphorylation Early Elicitor Signaling",23,17317660,,,,,,,,
KVSNPSFIAAQSK,ph,S,459,true,"Sucrose-induced phosphorylation",24,17586839,,,,,,,,
KVSNPSFIAAQSK,ph,S,459,true,"Phosphorylation nuclei-enriched fractions",28,19245862,,,,,,,,