Peptide,PTM,ModifiedAA,ModifiedPosition,PeptideUniqueToGene,ExperimentDesc,ExpID,PubmedID,ScoreType,IdentScore,LocProb,Log2FChange,PQ-val,QuantSig,PEP,MassErrorPPM
SLYFNVVSDHEPVR,ph,S,90,true,"Tissue atlas Arabidopsis - ProteomicsDB",114,32188942,"MaxQuant score",165.0200000,1.0000000,,,,2.1901600325003E-11,
SLYFNVVSDHEPVR,ph,S,97,true,"Tissue atlas Arabidopsis - ProteomicsDB",114,32188942,"MaxQuant score",216.0100000,1.0000000,,,,0,
SSTGGFTVTR,ph,T,106,true,"Tissue atlas Arabidopsis - ProteomicsDB",114,32188942,"MaxQuant score",67.4560000,0.7693200,,,,0.0064612301066518,
STWVSAAK,ph,S,156,true,"Tissue atlas Arabidopsis - ProteomicsDB",114,32188942,"MaxQuant score",68.4850000,0.9999980,,,,0.017310800030828,
QAQLAVLPAKR,ac,K,173,true,"Quantitative Acetylproteomics",101,29440448,,,,,,,,
GGGDDDDDDKEDEKNDSCGGGSALACTR,ph,S,198,true,"Tissue atlas Arabidopsis - ProteomicsDB",114,32188942,"MaxQuant score",75.6490000,0.9994200,,,,8.6693499601331E-13,
VVNASSSGLETSHLPPEISSPAVFR,ph,S,215,true,"Tissue atlas Arabidopsis - ProteomicsDB",114,32188942,"MaxQuant score",231.2200000,0.9277430,,,,0,
VVNASSSGLETSHLPPEISSPAVFR,ph,S,216,true,"Tissue atlas Arabidopsis - ProteomicsDB",114,32188942,"MaxQuant score",222.1300000,0.9231700,,,,0,
VVNASSSGLETSHLPPEISSPAVFR,ph,S,229,true,"Tissue atlas Arabidopsis - ProteomicsDB",114,32188942,"MaxQuant score",181.9200000,0.7608240,,,,0,
