Peptide,PTM,ModifiedAA,ModifiedPosition,PeptideUniqueToGene,ExperimentDesc,ExpID,PubmedID,ScoreType,IdentScore,LocProb,Log2FChange,PQ-val,QuantSig,PEP,MassErrorPPM
ALEICVKAAVGAPDHLGDCPFSQR,nt,A,2,true,"N-terminal ChaFRADIC",92,26010716,"MASCOT Score",60.1500000,,,,,2.3879999844212E-7,
ALEICVKAAVGAPDHLGDCPFSQR,nta,A,2,true,"N-terminal ChaFRADIC",92,26010716,"MASCOT Score",60.1500000,,,,,2.3879999844212E-7,
ALEICVKAAVGAPDHLGDCPFSQR,nta,A,2,true,"HUNTER N-terminome: legumain, GluC and trypsin",119,31951383,"MaxQuant score",134.7600000,,,,,,
AAVGAPDHLGDCPFSQR,ox,C,20,true,"OxiTRAQ Arabidopsis - 5 mM H2O2 versus control",47,24376095,,,,-0.1723955,0.3311058,NO,,
AAVGAPDHLGDCPFSQR,ox,C,20,true,"SPEAR - 10 mM H2O2 / mock",138a,34619326,,,,2.3549279,0.0333465,YES,,
AAVGAPDHLGDCPFSQR,ox,C,20,true,"SPEAR - 50 mM H2O2 / mock",138b,34619326,,,,2.8458091,0.0029674,YES,,
AAVGAPDHLGDCPFSQR,sno,C,20,true,"Endogenous S-nitrosylation in Arabidopsis",64,22115780,"MASCOT Score",42.0000000,,,,,,
AAVGAPDHLGDCPFSQR,sno,C,20,true,"Cold stress nitrosylation - 4°C vs 22°C",65,24388526,,,,,,,,
AAVGAPDHLGDCPFSQR,sno,C,20,true,"Site-specific nitrosomeproteomic id - gsnor1-3",90a,25699590,XCorr,3.5437088,,,,,0.0004958999925293,-4.9310447
AAVGAPDHLGDCPFSQR,sno,C,20,true,"hot5-4 / wildtype, FAT-switch S-nitrosoproteome",169,37277371,,,,1.6447427,0.0016333,YES,,
ALLTLEEKSLTYK,cr,K,33,true,"Open search Plant PTM Viewer 2.0 - Crotonylation",164c,TBA,,,,,,,,
VPVLKIDDK,ac,K,64,false,"Quantitative Acetylproteomics",101,29440448,,,,,,,,
SDVIVGILEE,nt,S,73,true,"N-terminal ChaFRADIC",92,26010716,"MASCOT Score",46.0000000,,,,,0.0041100000962615,
VSAVDLSLAPK,ac,K,157,false,"Quantitative Acetylproteomics",101,29440448,,,,,,,,
SVPESFPH,nt,S,172,false,"N-terminal ChaFRADIC",92,26010716,"MASCOT Score",23.5300000,,,,,0.014059999957681,
SFPHVHNYMKTLFSLDSFE,nt,S,176,false,"N-terminal ChaFRADIC",92,26010716,"MASCOT Score",20.9500000,,,,,1.9939999873486E-8,
TLFSLDSFEKTK,cr,K,195,false,"Open search Plant PTM Viewer 2.0 - Crotonylation",164c,TBA,,,,,,,,
TEEKYVISGWAPK,ub,K,201,true,"upl3 mutant / wildtype",168,35926874,"MaxQuant score",132.6400000,1.0000000,0.1902988,0.6931400,NO,3.8860101247984E-10,0.4165400
