Peptide,PTM,ModifiedAA,ModifiedPosition,PeptideUniqueToGene,ExperimentDesc,ExpID,PubmedID,ScoreType,IdentScore,LocProb,Log2FChange,PQ-val,QuantSig,PEP,MassErrorPPM
YPENSVVPATPLR,ph,T,267,true,"Tissue atlas Arabidopsis - ProteomicsDB",114,32188942,"MaxQuant score",178.1400000,1.0000000,,,,3.1734499453365E-21,
LCLAHNGKVVWDMKWR,nta,L,350,true,"Arabidopsis translation initiation landscape - NTA",167a,35069635,,,,,,,,
SLLNESPSR,ph,S,682,true,"Tyrosine phosphorylation in Arabidopsis",59,18463617,"MASCOT Score",22.0000000,,,,,,-1.1095913
SLLNESPSR,ph,S,682,true,"atm and atr DNA damage response",88,25561503,"MASCOT Score",50.0000000,0.9970000,,,,,0.3000000
SLLNESPSR,ph,S,682,true,"TOR Kinase and ABA Receptor",100,29290610,XCorr,2.3742666,0.9103000,,,,0.014430000446737,
SLLNESPSR,ph,S,682,true,"Phospho cell culture sucrose/TOR",109,30833711,,,0.8353940,,,,,
SLLNESPSR,ph,S,682,true,"Tissue atlas Arabidopsis - ProteomicsDB",114,32188942,"MaxQuant score",180.0700000,0.9973920,,,,1.0386199846835E-6,
YASNVSDVQPLAFAHVEDPGLESESEGTNNK,ph,S,708,true,"TOR Kinase and ABA Receptor",100,29290610,XCorr,5.2860880,0.9259000,,,,7.177000043157E-6,
YASNVSDVQPLAFAHVEDPGLESESEGTNNK,ph,S,708,true,"Tissue atlas Arabidopsis - ProteomicsDB",114,32188942,"MaxQuant score",232.2400000,0.9286810,,,,0,
