Peptide,PTM,ModifiedAA,ModifiedPosition,PeptideUniqueToGene,ExperimentDesc,ExpID,PubmedID,ScoreType,IdentScore,LocProb,Log2FChange,PQ-val,QuantSig,PEP,MassErrorPPM
NLTELVANLDAK,ng,N,66,true,"ER-associatied N-glycan degradation chilling stres",133,27558752,,,,,,,,
NLTELVANLDAK,ng,N,66,true,"UDP-GlcNAc transporter glycopeptide analysis",135,30224661,,,,,,,1.8826271741545E-7,0.8000000
NSSFVVTGHQNGAVLLHR,ng,N,192,true,"ER-associatied N-glycan degradation chilling stres",133,27558752,,,,,,,,
LTVLTENR,ng,N,270,true,"Conserved N-glycosylation",74,22633491,"MaxQuant Score",159.5500000,1.0000000,,,,0.0040000001899898,-0.0140000
IRETECEGLNHSLAR,ng,N,318,true,"Conserved N-glycosylation",74,22633491,"MaxQuant Score",211.5200000,1.0000000,,,,0,-0.4710000
ETECEGLNHSLAR,ng,N,318,true,"N-linked Glycan Micro-heterogeneity Arabidopsis",134,29237727,,,,,,,,
ETECEGLNHSLAR,ng,N,318,true,"UDP-GlcNAc transporter glycopeptide analysis",135,30224661,,,,,,,3.608857070958E-7,0.8000000
VFAFNVSTQHYVR,ng,N,393,true,"Conserved N-glycosylation",74,22633491,"MaxQuant Score",112.8000000,1.0000000,,,,1.4260000291699E-8,-0.2710000
VFAFNVSTQHYVR,ng,N,393,true,"N-linked Glycan Micro-heterogeneity Arabidopsis",134,29237727,,,,,,,,
VFAFNVSTQHYVR,ng,N,393,true,"UDP-GlcNAc transporter glycopeptide analysis",135,30224661,,,,,,,4.4291542655728E-10,-0.3000000
ESLTAWGPDDPFTPTGAQNSSAK,ph,T,511,true,"Large-scale phosphorylation discovery",44,23111157,XCorr,4.8160000,,,,,,
ESLTAWGPDDPFTPTGAQNSSAK,ph,T,511,true,"Tissue atlas Arabidopsis - ProteomicsDB",114,32188942,"MaxQuant score",227.0800000,0.9994930,,,,0,
SVGANDPSSR,ph,S,549,true,"atm and atr DNA damage response",88,25561503,"MASCOT Score",35.0000000,1.0000000,,,,,0.6200000
