Peptide,PTM,ModifiedAA,ModifiedPosition,PeptideUniqueToGene,ExperimentDesc,ExpID,PubmedID,ScoreType,IdentScore,LocProb,Log2FChange,PQ-val,QuantSig,PEP,MassErrorPPM
AAVSSSSETGDCGVTGKR,nt,A,2,true,"Arg/N-end rule seed, prt6 vs. Wt",99,29168982,"MASCOT Score",37.3600000,,,,,0.0050160000100732,-1.3443558
AAVSSSSETGDCGVTGKR,nta,A,2,true,"Arg/N-end rule seed, prt6 vs. Wt",99,29168982,"MASCOT Score",37.3600000,,-0.1406025,0.2494530,NO,0.0050160000100732,-1.3443558
AAVSSSSETGDCGVTGKR,nta,A,2,true,"FtsH12 N-terminome: WT / FtsH12 knockdown miRNA",118,33216923,"MaxQuant score",91.5840000,,,,,0.0021802999544889,
KCVSLNNLSDYEK,ph,S,39,true,"PAMP-triggered phosphorylation",48,24601666,"MASCOT Score",52.8000000,,,,,,
KCVSLNNLSDYEK,ph,S,39,true,"SnRK2 protein kinase substrates",85,23776212,XCorr,3.7697816,1.0000000,,,,5.5297801736742E-5,
KCVSLNNLSDYEK,ph,S,39,true,"Tissue atlas Arabidopsis - ProteomicsDB",114,32188942,"MaxQuant score",300.5600000,1.0000000,,,,0,
CVSLNNLSDYEK,ph,S,39,true,"STN8 phosphoproteome",38,21768351,"MASCOT Score",51.2900000,,,,,,
CVSLNNLSDYEK,ph,S,39,true,"PAMP-triggered phosphorylation",48,24601666,"MASCOT Score",58.4300000,,,,,,
CVSLNNLSDYEK,ph,S,39,true,"Tyrosine phosphorylation in Arabidopsis",59,18463617,"MASCOT Score",57.0000000,,,,,,-0.7233888
CVSLNNLSDYEK,ph,S,39,true,"Chloroplast kinase substrates",60,19376835,"MASCOT Score",48.9300000,,,,,,
CVSLNNLSDYEK,ph,S,39,true,"srk2dei ABA signaling phopshoproteomics",83,23572148,"MASCOT Score",75.0000000,,,,,,0.0002000
CVSLNNLSDYEK,ph,S,39,true,"LAXIC - ABA stress",84a,23660473,XCorr,4.0100000,1.0000000,,,,0.043705601245165,
CVSLNNLSDYEK,ph,S,39,true,"LAXIC - mannitol vs control",84b,23660473,XCorr,2.9800000,1.0000000,,,,0.00044224498560652,
CVSLNNLSDYEK,ph,S,39,true,"SnRK2 protein kinase substrates",85,23776212,XCorr,3.5241606,1.0000000,,,,0.02927890047431,
CVSLNNLSDYEK,ph,S,39,true,"atm and atr DNA damage response",88,25561503,"MASCOT Score",69.0000000,1.0000000,,,,,-0.9100000
CVSLNNLSDYEK,ph,S,39,true,"TOR Kinase and ABA Receptor",100,29290610,XCorr,4.4827938,1.0000000,,,,0.0007012999849394,
TPTQVASHAQK,ph,T,136,false,"Tissue atlas Arabidopsis - ProteomicsDB",114,32188942,"MaxQuant score",135.2100000,0.9737170,,,,6.4315800045733E-6,
HSAFTMMPSFSDGDSNSSIIR,ph,S,271,true,"Tissue atlas Arabidopsis - ProteomicsDB",114,32188942,"MaxQuant score",129.7800000,0.9911590,,,,2.781600053899E-19,
