Peptide,PTM,ModifiedAA,ModifiedPosition,PeptideUniqueToGene,ExperimentDesc,ExpID,PubmedID,ScoreType,IdentScore,LocProb,Log2FChange,PQ-val,QuantSig,PEP,MassErrorPPM
GSSSDIVPDRSPADDVAPVTDTK,ph,S,3,true,"Tissue atlas Arabidopsis - ProteomicsDB",114,32188942,"MaxQuant score",210.1600000,0.8550720,,,,0,
GSSSDIVPDRSPADDVAPVTDTK,ph,S,4,true,"Tissue atlas Arabidopsis - ProteomicsDB",114,32188942,"MaxQuant score",400.6900000,0.9784150,,,,0,
GSSSDIVPDR,ph,S,4,true,"atm and atr DNA damage response",88,25561503,"MASCOT Score",56.0000000,0.9110000,,,,,-0.4400000
GSSSDIVPDRSPADDVAPVTDTK,ph,S,5,true,"Tissue atlas Arabidopsis - ProteomicsDB",114,32188942,"MaxQuant score",93.2690000,0.9441980,,,,1.7777600502811E-9,
GSSSDIVPDRSPADDVAPVTDTKIPK,ph,S,12,true,"STN8 phosphoproteome",38,21768351,"MASCOT Score",90.9800000,,,,,,-0.7219630
GSSSDIVPDRSPADDVAPVTDTK,ph,S,12,true,"STN8 phosphoproteome",38,21768351,"MASCOT Score",55.0600000,,,,,,-0.6619040
GSSSDIVPDRSPADDVAPVTDTK,ph,S,12,true,"Phospho cell culture sucrose/TOR",109,30833711,,,0.9511400,,,,,
GSSSDIVPDRSPADDVAPVTDTK,ph,S,12,true,"Col-0 callus - FC Col-0 vs. Col-0 Xray",111a,31410901,,24.5600000,,0.1512701,0.0000000,NO,,1.3250062
GSSSDIVPDRSPADDVAPVTDTK,ph,S,12,true,"Col-0 X-ray callus - FC Col-0 vs. Col-0 Xray",111b,31410901,,24.5600000,,0.1512701,0.0000000,NO,,1.3250062
GSSSDIVPDRSPADDVAPVTDTK,ph,S,12,true,"atm callus - FC atm vs. atm Xray",111c,31410901,,24.5600000,,0.3886733,0.0000000,NO,,1.3250062
GSSSDIVPDRSPADDVAPVTDTK,ph,S,12,true,"atm-3 X-ray callus - FC atm vs. atm Xray",111d,31410901,,24.5600000,,0.3886733,0.0000000,NO,,1.3250062
GSSSDIVPDRSPADDVAPVTDTK,ph,S,12,true,"Tissue atlas Arabidopsis - ProteomicsDB",114,32188942,"MaxQuant score",400.6900000,1.0000000,,,,0,
RREEVVEEDEDSEDDDQEDEENDGDDESNPK,ph,S,85,true,"LAXIC - mannitol vs control",84b,23660473,XCorr,5.0900000,1.0000000,,,,4.4500000743759E-14,
RREEVVEEDEDSEDDDQEDEENDGDDESNPK,ph,S,85,true,"SnRK2 protein kinase substrates",85,23776212,XCorr,4.2883515,1.0000000,,,,0.0032759399618953,
RREEVVEEDEDSEDDDQEDEENDGDDESNPK,ph,S,85,true,"Brassinosteroid-Regulated Phosphorylation Dynamics",94,26187819,"MaxQuant Score",153.2700000,1.0000000,,,,6.3779998817989E-30,1.0240000
RREEVVEEDEDSEDDDQEDEENDGDDESNPK,ph,S,85,true,"TOR Kinase and ABA Receptor",100,29290610,XCorr,5.7991171,1.0000000,,,,2.7489999609998E-8,
REEVVEEDEDSEDDDQEDEENDGDDESNPK,ph,S,85,true,"LAXIC - mannitol vs control",84b,23660473,XCorr,5.8400000,1.0000000,,,,4.3499999046065E-16,
REEVVEEDEDSEDDDQEDEENDGDDESNPK,ph,S,85,true,"SnRK2 protein kinase substrates",85,23776212,XCorr,5.5699158,1.0000000,,,,0.00018478100537322,
REEVVEEDEDSEDDDQEDEENDGDDESNPK,ph,S,85,true,"TOR Kinase and ABA Receptor",100,29290610,XCorr,8.1021891,1.0000000,,,,4.7560001076308E-11,
REEVVEEDEDSEDDDQEDEENDGDDESNPK,ph,S,85,true,"Col-0 callus - FC Col-0 vs. Col-0 Xray",111a,31410901,,95.4400000,,3.7987882,0.0000000,NO,,1.3778124
REEVVEEDEDSEDDDQEDEENDGDDESNPK,ph,S,85,true,"Col-0 X-ray callus - FC Col-0 vs. Col-0 Xray",111b,31410901,,95.4400000,,3.7987882,0.0000000,NO,,1.3778124
REEVVEEDEDSEDDDQEDEENDGDDESNPK,ph,S,85,true,"atm callus - FC atm vs. atm Xray",111c,31410901,,95.4400000,,,0.0000000,NO,,1.3778124
EEVVEEDEDSEDDDQEDEENDGDDESNPK,ph,S,85,true,"STN8 phosphoproteome",38,21768351,"MASCOT Score",74.2400000,,,,,,-1.2076500
KKHPSPEHPLHR,ph,S,432,true,"Tissue atlas Arabidopsis - ProteomicsDB",114,32188942,"MaxQuant score",144.8000000,1.0000000,,,,8.0981799044366E-9,
KHPSPEHPLHR,ph,S,432,true,"atm and atr DNA damage response",88,25561503,"MASCOT Score",35.0000000,1.0000000,,,,,-0.6100000
KHPSPEHPLHR,ph,S,432,true,"Phospho cell culture sucrose/TOR",109,30833711,,,1.0000000,,,,,
KHPSPEHPLHR,ph,S,432,true,"Col-0 callus - FC Col-0 vs. Col-0 Xray",111a,31410901,,25.0400000,,-0.1789303,0.0000000,NO,,0.0594796
KHPSPEHPLHR,ph,S,432,true,"Col-0 X-ray callus - FC Col-0 vs. Col-0 Xray",111b,31410901,,25.0400000,,-0.1789303,0.0000000,NO,,0.0594796
HPSPEHPLHR,ph,S,432,true,"TOR Kinase and ABA Receptor",100,29290610,XCorr,3.0994997,1.0000000,,,,4.0660001104698E-5,
HPSPEHPLHR,ph,S,432,true,"Lateral root-induction - NAA vs control",106,23328941,"MASCOT Score",34.0000000,,,,,,
STSSTHPTEPVNDTASGR,ph,S,455,true,"Tissue atlas Arabidopsis - ProteomicsDB",114,32188942,"MaxQuant score",127.3700000,0.7757240,,,,1.5598499664778E-14,
STSSTHPTEPVNDTASGR,ph,T,466,true,"Lateral root-induction - NAA vs control",106,23328941,"MASCOT Score",21.0000000,,,,,,
STSSTHPTEPVNDTASGR,ph,T,466,true,"Tissue atlas Arabidopsis - ProteomicsDB",114,32188942,"MaxQuant score",147.4100000,0.8421910,,,,1.6033999510556E-17,
STSSTHPTEPVNDTASGR,ph,S,468,true,"atm and atr DNA damage response",88,25561503,"MASCOT Score",43.0000000,1.0000000,,,,,-0.1500000
STSSTHPTEPVNDTASGR,ph,S,468,true,"Lateral root-induction - NAA vs control",106,23328941,"MASCOT Score",48.0000000,,,,,,
STSSTHPTEPVNDTASGR,ph,S,468,true,"Tissue atlas Arabidopsis - ProteomicsDB",114,32188942,"MaxQuant score",197.6900000,0.9973480,,,,0,
SSDFADYDDFDEHR,ph,S,471,true,"Tissue atlas Arabidopsis - ProteomicsDB",114,32188942,"MaxQuant score",204.5300000,0.8864750,,,,0,
SSDFADYDDFDEHRDESLDR,ph,S,472,true,"Col-0 callus - FC Col-0 vs. Col-0 Xray",111a,31410901,,22.3900000,,1.5985002,0.0000000,NO,,0.9224220
SSDFADYDDFDEHRDESLDR,ph,S,472,true,"Col-0 X-ray callus - FC Col-0 vs. Col-0 Xray",111b,31410901,,22.3900000,,1.5985002,0.0000000,NO,,0.9224220
SSDFADYDDFDEHRDESLDR,ph,S,472,true,"atm callus - FC atm vs. atm Xray",111c,31410901,,22.3900000,,2.3212427,0.0000000,NO,,0.9224220
SSDFADYDDFDEHRDESLDR,ph,S,472,true,"atm-3 X-ray callus - FC atm vs. atm Xray",111d,31410901,,22.3900000,,2.3212427,0.0000000,NO,,0.9224220
KLSSGSEGDEEKGDEEYK,ph,S,542,true,"Tissue atlas Arabidopsis - ProteomicsDB",114,32188942,"MaxQuant score",109.9600000,1.0000000,,,,2.5831400820436E-12,
KLSSGSEGDEEKGDEEYK,ph,S,544,true,"Tissue atlas Arabidopsis - ProteomicsDB",114,32188942,"MaxQuant score",109.9600000,1.0000000,,,,2.5831400820436E-12,
AKKMPRR,ac,K,591,true,"Lysine acetylation gel-based Arabidopsis",36,21311030,"MASCOT Score",54.0000000,,,,,,-0.0371000
SRSNDFRPGLR,ph,S,604,true,"Tissue atlas Arabidopsis - ProteomicsDB",114,32188942,"MaxQuant score",53.1930000,0.9412590,,,,0.0075149000622332,
IDYQQYEFSDSDKEATGLAK,ph,S,628,true,"srk2dei ABA signaling phopshoproteomics",83,23572148,"MASCOT Score",41.0000000,,,,,,0.0009000
IDYQQYEFSDSDKEATGLAK,ph,S,628,true,"SnRK2 protein kinase substrates",85,23776212,XCorr,3.6701891,0.9780000,,,,0.02514679916203,
IDYQQYEFSDSDKEATGLAK,ph,S,628,true,"Phospho cell culture sucrose/TOR",109,30833711,,,0.9993600,,,,,
IDYQQYEFSDSDKEATGLAK,ph,S,628,true,"Col-0 callus - FC Col-0 vs. Col-0 Xray",111a,31410901,,41.4400000,,0.0014061,0.0000000,NO,,1.7886937
IDYQQYEFSDSDKEATGLAK,ph,S,628,true,"Col-0 X-ray callus - FC Col-0 vs. Col-0 Xray",111b,31410901,,41.4400000,,0.0014061,0.0000000,NO,,1.7886937
IDYQQYEFSDSDKEATGLAK,ph,S,628,true,"atm callus - FC atm vs. atm Xray",111c,31410901,,41.4400000,,1.7146066,0.0000000,NO,,1.7886937
IDYQQYEFSDSDKEATGLAK,ph,S,628,true,"atm-3 X-ray callus - FC atm vs. atm Xray",111d,31410901,,41.4400000,,1.7146066,0.0000000,NO,,1.7886937
IDYQQYEFSDSDKEATGLAK,ph,S,628,true,"Tissue atlas Arabidopsis - ProteomicsDB",114,32188942,"MaxQuant score",250.4500000,1.0000000,,,,0,
IDYQQYEFSDSDK,ph,S,628,true,"srk2dei ABA signaling phopshoproteomics",83,23572148,"MASCOT Score",29.0000000,,,,,,-0.0009000
IDYQQYEFSDSDK,ph,S,628,true,"TOR Kinase and ABA Receptor",100,29290610,XCorr,5.1304474,0.9996000,,,,0.00056080002104864,
IDYQQYEFSDSDKEATGLAK,ph,S,630,true,"srk2dei ABA signaling phopshoproteomics",83,23572148,"MASCOT Score",41.0000000,,,,,,0.0009000
IDYQQYEFSDSDKEATGLAK,ph,S,630,true,"SnRK2 protein kinase substrates",85,23776212,XCorr,3.0635121,1.0000000,,,,9.1001602697816E-8,
IDYQQYEFSDSDKEATGLAK,ph,S,630,true,"Phospho cell culture sucrose/TOR",109,30833711,,,0.9978810,,,,,
IDYQQYEFSDSDKEATGLAK,ph,S,630,true,"Col-0 callus - FC Col-0 vs. Col-0 Xray",111a,31410901,,41.4400000,,0.0014061,0.0000000,NO,,1.7886937
IDYQQYEFSDSDKEATGLAK,ph,S,630,true,"Col-0 X-ray callus - FC Col-0 vs. Col-0 Xray",111b,31410901,,41.4400000,,0.0014061,0.0000000,NO,,1.7886937
IDYQQYEFSDSDKEATGLAK,ph,S,630,true,"atm callus - FC atm vs. atm Xray",111c,31410901,,41.4400000,,1.7146066,0.0000000,NO,,1.7886937
IDYQQYEFSDSDKEATGLAK,ph,S,630,true,"atm-3 X-ray callus - FC atm vs. atm Xray",111d,31410901,,41.4400000,,1.7146066,0.0000000,NO,,1.7886937
IDYQQYEFSDSDKEATGLAK,ph,S,630,true,"Tissue atlas Arabidopsis - ProteomicsDB",114,32188942,"MaxQuant score",250.4500000,0.9999710,,,,0,
IDYQQYEFSDSDK,ph,S,630,true,"srk2dei ABA signaling phopshoproteomics",83,23572148,"MASCOT Score",29.0000000,,,,,,-0.0009000
IDYQQYEFSDSDK,ph,S,630,true,"TOR Kinase and ABA Receptor",100,29290610,XCorr,5.1304474,1.0000000,,,,0.00056080002104864,
IDYQQYEFSDSDKEATGLAK,ph,T,635,true,"srk2dei ABA signaling phopshoproteomics",83,23572148,"MASCOT Score",23.0000000,,,,,,-0.0011000
SGEEEEPRDVNDNADTTNGKENNQLNK,ph,S,676,true,"SnRK2 protein kinase substrates",85,23776212,XCorr,3.5834024,0.9970000,,,,0.027361299842596,
SGEEEEPRDVNDNADTTNGKENNQLNK,ph,S,676,true,"Tissue atlas Arabidopsis - ProteomicsDB",114,32188942,"MaxQuant score",218.7300000,1.0000000,,,,0,
SGEEEEPRDVNDNADTTNGK,ph,S,676,true,"TOR Kinase and ABA Receptor",100,29290610,XCorr,4.1974921,1.0000000,,,,3.0300000162242E-6,
SNGTTDQEEVEGVVGK,ph,T,707,true,"Tissue atlas Arabidopsis - ProteomicsDB",114,32188942,"MaxQuant score",72.2900000,0.7961800,,,,0.0012425900204107,
