Peptide,PTM,ModifiedAA,ModifiedPosition,PeptideUniqueToGene,ExperimentDesc,ExpID,PubmedID,ScoreType,IdentScore,LocProb,Log2FChange,PQ-val,QuantSig,PEP,MassErrorPPM
QTVSVTPAIDHSGVFR,ph,S,11,true,"Tissue atlas Arabidopsis - ProteomicsDB",114,32188942,"MaxQuant score",140.2200000,0.8108360,,,,1.6321299867172E-8,
QTVSVTPAIDHSGVFR,ph,T,13,true,"Tissue atlas Arabidopsis - ProteomicsDB",114,32188942,"MaxQuant score",117.2000000,0.9966510,,,,4.5035199036647E-7,
QTVSVTPAIDHSGVFR,ph,S,19,true,"atm and atr DNA damage response",88,25561503,"MASCOT Score",40.0000000,1.0000000,,,,,-0.1400000
QTVSVTPAIDHSGVFR,ph,S,19,true,"Tissue atlas Arabidopsis - ProteomicsDB",114,32188942,"MaxQuant score",54.3060000,0.9999650,,,,0.002708219923079,
SGSELGSDFGELSESGR,ph,S,76,true,"Phosphorylation Early Elicitor Signaling",23,17317660,,,,,,,,
VADFGLANFCNASGNKQPLTSR,ph,T,290,true,"Phosphorylation Early Elicitor Signaling",23,17317660,,,,,,,,
MQKPSNHEKDEASHVK,ph,S,514,true,"Tissue atlas Arabidopsis - ProteomicsDB",114,32188942,"MaxQuant score",115.3900000,1.0000000,,,,9.8167902251589E-8,
GHIPNLLGPSPAFSENTDVDSK,ph,S,577,true,"Tissue atlas Arabidopsis - ProteomicsDB",114,32188942,"MaxQuant score",68.1010000,0.9990820,,,,3.0316699849209E-5,
TDSQDREAYEMLK,ph,T,603,true,"Plasmamembrane phosphorylation",20,15308754,,,,,,,,
TDSQDREAYEMLK,ph,S,605,true,"Phosphorylation Early Elicitor Signaling",23,17317660,,,,,,,,
TDSQDREAYEMLK,ph,S,605,true,"atm and atr DNA damage response",88,25561503,"MASCOT Score",28.0000000,1.0000000,,,,,2.1400000
TDSQDREAYEMLK,ph,S,605,true,"Tissue atlas Arabidopsis - ProteomicsDB",114,32188942,"MaxQuant score",176.8100000,0.9998970,,,,1.1112100297669E-15,
IEFSGPLLSK,ph,S,671,true,"TOR Kinase and ABA Receptor",100,29290610,XCorr,3.4500282,1.0000000,,,,2.9810000341968E-5,
IEFSGPLLSK,ph,S,671,true,"Tissue atlas Arabidopsis - ProteomicsDB",114,32188942,"MaxQuant score",150.0900000,0.9999970,,,,1.2612000112827E-33,
