Peptide,PTM,ModifiedAA,ModifiedPosition,PeptideUniqueToGene,ExperimentDesc,ExpID,PubmedID,ScoreType,IdentScore,LocProb,Log2FChange,PQ-val,QuantSig,PEP,MassErrorPPM
EVQPEISADDRVIFPESPTSDPVMSQGTGAR,ph,S,132,true,"TOR Kinase and ABA Receptor",100,29290610,XCorr,5.0572791,0.9389000,,,,0.00045779999345541,
VIFPESPTSDPVMSQGTGAR,ph,S,132,true,"TOR Kinase and ABA Receptor",100,29290610,XCorr,3.8894150,0.9915000,,,,0.00022679999528918,
VIFPESPTSDPVMSQGTGAR,ph,S,132,true,"Tissue atlas Arabidopsis - ProteomicsDB",114,32188942,"MaxQuant score",162.1500000,0.9989540,,,,3.7880098944401E-29,
REDSPRPYGLK,ph,S,178,false,"Tissue atlas Arabidopsis - ProteomicsDB",114,32188942,"MaxQuant score",74.7890000,0.9999980,,,,0.00066568399779499,
ELPRLSLDSR,ph,S,242,false,"Tissue atlas Arabidopsis - ProteomicsDB",114,32188942,"MaxQuant score",91.3070000,0.9999940,,,,0.00088592298561707,
RPPSVVAKLMGLETLPGSPLSR,ph,S,279,true,"SIRK1 phosphorylation",86a,23820729,"MaxQuant Score",125.4700000,1.0000000,,,,0.045000001788139,6.7690000
RPPSVVAKLMGLETLPGSPLSR,ph,T,289,true,"SIRK1 phosphorylation",86a,23820729,"MaxQuant Score",125.4700000,1.0000000,,,,0.045000001788139,6.7690000
LMGLETLPGSPLSR,ph,S,293,true,"TOR Kinase and ABA Receptor",100,29290610,XCorr,4.2637806,0.9861000,,,,0.00011870000162162,
LMGLETLPGSPLSR,ph,S,293,true,"Tissue atlas Arabidopsis - ProteomicsDB",114,32188942,"MaxQuant score",149.3000000,0.9825810,,,,1.3584299700733E-12,
RLNSSHDETSQDYIASLCENSDPDTDHR,ph,S,758,true,"Tissue atlas Arabidopsis - ProteomicsDB",114,32188942,"MaxQuant score",123.6200000,0.7869580,,,,1.6577360832963E-42,
GCSSSSNEK,sno,C,828,true,"hot5-4 / wildtype, FAT-switch S-nitrosoproteome",169,37277371,,,,-0.1080931,0.0594003,NO,,
